program: Orca
programVersion: 5.0.2
elementType: O O O N C C C C C C C C C H H H H H H H H H H H H H H
charge: 1
multiplicity: 1
keywords: wB97X-D3 TightOpt Freq def2-TZVPP def2/J RIJCOSX TightSCF defgrid3 CHELPG
frequency: 0.00 0.00 0.00 0.00 0.00 0.00 40.13 55.83 105.81 122.68 181.07 189.10 224.66 234.82 277.77 298.60 314.21 332.69 361.58 365.51 426.01 470.05 483.91 508.05 536.92 593.28 637.35 697.91 755.08 768.69 819.39 833.75 847.81 907.03 921.53 961.90 968.80 988.92 1015.06 1067.18 1100.40 1143.12 1155.56 1163.14 1181.56 1201.79 1223.41 1258.92 1295.05 1314.49 1340.74 1354.33 1369.95 1381.47 1403.09 1405.16 1423.98 1451.58 1475.56 1500.83 1507.24 1510.53 1523.80 1588.80 1674.02 1683.71 1698.35 3069.98 3100.15 3115.41 3184.10 3195.42 3201.60 3201.87 3202.45 3210.02 3418.58 3466.89 3844.70 3898.45 3911.63
frequency: 40.13 55.83 105.81 122.68 181.07 189.10 224.66 234.82 277.77 298.60 314.21 332.69 361.58 365.51 426.01 470.05 483.91 508.05 536.92 593.28 637.35 697.91 755.08 768.69 819.39 833.75 847.81 907.03 921.53 961.90 968.80 988.92 1015.06 1067.18 1100.40 1143.12 1155.56 1163.14 1181.56 1201.79 1223.41 1258.92 1295.05 1314.49 1340.74 1354.33 1369.95 1381.47 1403.09 1405.16 1423.98 1451.58 1475.56 1500.83 1507.24 1510.53 1523.80 1588.80 1674.02 1683.71 1698.35 3069.98 3100.15 3115.41 3184.10 3195.42 3201.60 3201.87 3202.45 3210.02 3418.58 3466.89 3844.70 3898.45 3911.63
formula: C9H14NO3
InChI: InChI=1S/C9H14NO3/c1-10-5-9(13)6-2-3-7(11)8(12)4-6/h2-4,9,11-13H,5,10H2,1H3
27 atoms
O  -2.038777 -0.676558 1.768453
O  2.262906 1.829498 0.998651
O  3.757345 0.348696 -0.632014
N  -2.460462 0.852757 -0.380222
C  -1.541725 -1.206967 0.55564
C  -0.10134 -0.833452 0.268123
C  -2.48708 -0.635709 -0.497365
C  0.452433 0.335056 0.795038
C  0.657324 -1.625679 -0.578695
C  1.746843 0.705824 0.474499
C  1.95706 -1.258305 -0.904524
C  2.50278 -0.099736 -0.387012
C  -3.378945 1.576046 -1.294644
H  -1.649569 -2.295341 0.527543
H  -3.512152 -0.955305 -0.316538
H  -2.182452 -0.906476 -1.505845
H  -0.085148 0.948458 1.508779
H  0.250948 -2.546054 -0.980668
H  -1.492877 1.158311 -0.519262
H  2.550448 -1.886556 -1.558317
H  -1.515832 -0.987528 2.509161
H  -4.398243 1.259211 -1.091071
H  -3.113665 1.336067 -2.320785
H  -3.280826 2.644926 -1.125161
H  3.175076 1.927144 0.708492
H  4.254322 -0.264254 -1.174714
H  -2.671882 1.06293 0.59855
totalener: -631.65676141 hartree
nucrepener: 826.38326088 hartree
electener: -1458.04002228 hartree
oneelecener: -2484.83451590 hartree
twoeener: 1026.79449361 hartree
kineticenergy: 628.52168798 hartree
xcener: -59.731043796502 hartree
chargesum: 1.0000000
charge: -0.343146 -0.276761 -0.311017 0.061337 0.145030 0.039993 -0.143813 -0.320540 -0.234475 0.182403 -0.100490 0.180160 -0.170774 0.142704 0.151005 0.149691 0.154690 0.129717 0.206275 0.119518 0.205093 0.139337 0.137766 0.144458 0.215243 0.201733 0.194863
charge: 0.301554 0.376187 0.362160 0.527335 -0.169076 -0.119485 0.026036 -0.029062 -0.016323 -0.201399 -0.006158 -0.198500 0.078330 0.040626 0.038186 0.038813 0.021884 0.027449 0.046589 0.028754 -0.110371 0.030329 0.029660 0.028745 -0.099812 -0.097643 0.045195
qa: -0.3431 -0.2768 -0.3110 0.0613 0.1450 0.0400 -0.1438 -0.3205 -0.2345 0.1824 -0.1005 0.1802 -0.1708 0.1427 0.1510 0.1497 0.1547 0.1297 0.2063 0.1195 0.2051 0.1393 0.1378 0.1445 0.2152 0.2017 0.1949
va: 2.0868 2.2220 2.1600 3.6620 3.9295 3.5603 3.8325 3.9549 4.1080 4.1838 3.9231 3.8963 3.8483 0.9856 1.0088 1.0002 1.0300 1.0127 0.9891 1.0102 1.0340 0.9950 0.9923 0.9928 1.0403 1.0412 1.0082
dispcorr: -0.010613415 hartree
energy: -631.669167928131
dipole: -13.72177 11.13727 -2.58450 0.49751 -0.30883 0.18868 -4.79029 3.48027 -1.31002
magnitude: 2.90368 au
magnitude: 7.38057 debye
temp: 298.15 k
press: 1.00 atm
zeropoint: 0.23388791 hartree
thermalvibcorrection: 0.01018815 hartree
thermalrotcorrection: 0.00141627 hartree
thermaltrasncorrection: 0.00141627 hartree
thermaltotal: -631.42225932 hartree
thermalcorr: 0.01302069 hartree
nonthermalcorr: 0.23388791 hartree
totalcorr: 0.24690860 hartree
thermalcorrenthalpy: 0.00094421 hartree
totalenthalpy: -631.42131511 hartree
totalentropycorr: -0.05210113 hartree
gibbsenthalpy: -631.47341624 hartree
gibbsminuselec: 0.19575169 hartree
