program: Orca
programVersion: 5.0.2
elementType: S S C S N C H H C H H H C H H C H H H C S N C H H C H H H C H H C H H H H
charge: 1
multiplicity: 1
keywords: wB97X-D3 TightOpt Freq def2-TZVPP def2/J RIJCOSX TightSCF defgrid3 CHELPG
frequency: 0.00 0.00 0.00 0.00 0.00 0.00 20.27 26.39 32.25 45.12 61.53 63.59 85.55 120.47 128.32 155.07 165.00 167.94 174.79 194.24 210.94 226.61 233.02 251.70 294.34 298.29 305.45 319.60 326.94 356.27 421.70 447.60 451.73 456.63 470.97 476.41 558.42 570.80 587.11 624.67 636.23 783.28 784.24 794.43 803.08 831.56 837.46 920.75 943.29 959.18 999.35 1034.82 1045.80 1051.59 1097.00 1099.07 1113.48 1115.29 1126.11 1127.37 1187.95 1193.11 1237.47 1244.51 1323.59 1326.71 1331.26 1344.33 1383.31 1384.71 1399.89 1402.94 1424.02 1431.09 1432.47 1437.50 1478.90 1493.13 1493.91 1494.67 1494.94 1502.22 1503.38 1508.55 1508.77 1518.85 1519.63 1526.52 1562.86 1621.97 2778.71 3072.12 3074.24 3079.66 3083.42 3092.90 3095.30 3100.42 3111.58 3133.37 3146.84 3147.16 3153.49 3153.79 3158.68 3162.51 3163.80 3167.09 3168.24 3170.54 3174.10
frequency: 20.27 26.39 32.25 45.12 61.53 63.59 85.55 120.47 128.32 155.07 165.00 167.94 174.79 194.24 210.94 226.61 233.02 251.70 294.34 298.29 305.45 319.60 326.94 356.27 421.70 447.60 451.73 456.63 470.97 476.41 558.42 570.80 587.11 624.67 636.23 783.28 784.24 794.43 803.08 831.56 837.46 920.75 943.29 959.18 999.35 1034.82 1045.80 1051.59 1097.00 1099.07 1113.48 1115.29 1126.11 1127.37 1187.95 1193.11 1237.47 1244.51 1323.59 1326.71 1331.26 1344.33 1383.31 1384.71 1399.89 1402.94 1424.02 1431.09 1432.47 1437.50 1478.90 1493.13 1493.91 1494.67 1494.94 1502.22 1503.38 1508.55 1508.77 1518.85 1519.63 1526.52 1562.86 1621.97 2778.71 3072.12 3074.24 3079.66 3083.42 3092.90 3095.30 3100.42 3111.58 3133.37 3146.84 3147.16 3153.49 3153.79 3158.68 3162.51 3163.80 3167.09 3168.24 3170.54 3174.10
formula: C10H21N2S4
InChI: InChI=1S/C10H21N2S4/c1-5-11(6-2)9(13)15-16-10(14)12(7-3)8-4/h13H,5-8H2,1-4H3
37 atoms
S  -0.832878 -0.186147 -1.541435
S  1.014685 -0.87171 -1.178899
C  1.819987 0.583222 -0.390137
S  0.932458 1.848238 0.168708
N  3.135887 0.434928 -0.304964
C  3.875234 -0.698605 -0.87341
H  3.32746 -1.083436 -1.733187
H  4.805964 -0.296295 -1.27213
C  4.159478 -1.808486 0.127248
H  4.808248 -1.464694 0.931153
H  3.238618 -2.19016 0.569605
H  4.661544 -2.63389 -0.376449
C  3.933975 1.445211 0.412025
H  4.955117 1.344095 0.047342
H  3.566699 2.426326 0.114813
C  3.888646 1.297222 1.924539
H  2.870175 1.393486 2.296498
H  4.292606 0.339476 2.24917
H  4.487311 2.086139 2.378785
C  -1.655728 -0.257729 0.015203
S  -1.028472 -1.3972 1.147374
N  -2.707446 0.494059 0.180843
C  -3.622135 0.365738 1.334758
H  -4.227796 1.268386 1.335663
H  -3.033624 0.400599 2.252716
C  -4.516264 -0.862467 1.263489
H  -5.160488 -0.883912 2.141401
H  -5.151365 -0.831496 0.380128
H  -3.950088 -1.792404 1.238763
C  -3.066729 1.546233 -0.799662
H  -3.425133 2.389342 -0.211733
H  -2.150647 1.868404 -1.290261
C  -4.113876 1.092952 -1.80148
H  -5.058015 0.845879 -1.317462
H  -4.304107 1.902164 -2.505075
H  -3.778176 0.22527 -2.369756
H  -1.863514 -1.11333 2.150306
totalener: -2095.83576990 hartree
nucrepener: 1758.56480618 hartree
electener: -3854.40057609 hartree
oneelecener: -6359.86507125 hartree
twoeener: 2505.46449517 hartree
kineticenergy: 2090.10082394 hartree
xcener: -127.674434526479 hartree
chargesum: 1.0000000
charge: 0.088603 -0.007376 0.129758 -0.311748 -0.063666 -0.095478 0.109888 0.108969 -0.219319 0.097781 0.076360 0.109844 -0.056167 0.099042 0.118765 -0.225276 0.090515 0.081743 0.106839 0.131022 0.040243 -0.002321 -0.124241 0.119181 0.122246 -0.205939 0.119055 0.098111 0.085827 -0.087087 0.114063 0.121912 -0.216488 0.094542 0.119044 0.089472 0.142280
charge: 0.461879 0.380714 -0.768823 0.214238 0.252975 -0.064909 0.005949 0.029024 0.013579 0.015022 0.011421 0.025493 -0.044776 0.024151 0.020493 0.011799 0.009521 0.008399 0.024365 -0.656606 0.659792 0.290272 -0.032738 0.035470 0.021178 0.020389 0.031358 0.019558 0.010838 -0.039321 0.031181 0.013724 0.020426 0.016294 0.032278 0.016980 -0.121588
qa: 0.0886 -0.0074 0.1298 -0.3117 -0.0637 -0.0955 0.1099 0.1090 -0.2193 0.0978 0.0764 0.1098 -0.0562 0.0990 0.1188 -0.2253 0.0905 0.0817 0.1068 0.1310 0.0402 -0.0023 -0.1242 0.1192 0.1222 -0.2059 0.1191 0.0981 0.0858 -0.0871 0.1141 0.1219 -0.2165 0.0945 0.1190 0.0895 0.1423
va: 2.5551 2.4505 4.1790 2.1420 3.2778 3.8934 1.0030 1.0009 3.9109 1.0043 1.0085 1.0114 3.8402 1.0007 1.0115 3.9069 1.0172 1.0064 1.0096 4.1113 2.4739 3.3103 3.9001 0.9984 0.9944 3.9103 1.0069 1.0062 1.0124 3.8479 0.9981 1.0212 3.9222 1.0057 1.0090 1.0079 1.0170
dispcorr: -0.018687407 hartree
energy: -2095.859385945762
dipole: -2.08193 0.34655 -1.73539 1.96987 -2.40178 -0.43191 8.27193 -7.65026 0.62167
magnitude: 1.89330 au
magnitude: 4.81239 debye
temp: 298.15 k
press: 1.00 atm
zeropoint: 0.31104781 hartree
thermalvibcorrection: 0.01823485 hartree
thermalrotcorrection: 0.00141627 hartree
thermaltrasncorrection: 0.00141627 hartree
thermaltotal: -2095.52727074 hartree
thermalcorr: 0.02106739 hartree
nonthermalcorr: 0.31104781 hartree
totalcorr: 0.33211520 hartree
thermalcorrenthalpy: 0.00094421 hartree
totalenthalpy: -2095.52632653 hartree
totalentropycorr: -0.06965974 hartree
gibbsenthalpy: -2095.59598627 hartree
gibbsminuselec: 0.26339967 hartree
