program: Gaussian 09
title: 000044745
version: EM64L-G09RevD.01
frameworkgroup: C1[X(C20H28N2O)]
method: RPBEPBE
basis: SDD
operation: Freq
keyword: #p
keyword: freq=noraman
keyword: PBEPBE/SDD
title: #p freq=noraman PBEPBE/SDD
converged: YES YES NO NO
title: Mulliken charges:
elementType: O N N C C C C C C C C C C C C C C C C C C C C H H H H H H H H H H H H H H H H H H H H H H H H H H H H
charge: -0.267583 -0.125577 -0.327397 -0.426931 -0.422323 -0.352264 -0.327378 -0.049966 0.299858 -0.337630 -0.340068 0.218004 0.178113 -0.429215 -0.695013 -0.695861 0.148580 -0.364829 -0.406431 -0.400992 -0.262246 -0.240330 -0.532929 0.207871 0.220253 0.255638 0.203311 0.229624 0.196972 0.206679 0.190780 0.191556 0.195118 0.189253 0.203024 0.259788 0.210923 0.216725 0.216499 0.213924 0.217287 0.209555 0.260933 0.239985 0.272575 0.209750 0.224673 0.227162 0.243616 0.225560 0.221374
chargesum: 0.00000
title: Mulliken charges with hydrogens summed into heavy atoms:
elementType: O N N C C C C C C C C C C C C C C C C C C C C
charge: -0.267583 -0.125577 -0.117647 0.001193 0.036627 0.074332 0.070081 -0.049966 0.299858 0.049044 0.052209 0.218004 0.178113 -0.169427 -0.050867 -0.055095 0.148580 -0.103896 -0.166445 -0.128416 -0.037573 -0.013168 0.157620
polarizability: 2.98737275e+02 -7.44172964e+00 2.04007208e+02 9.19478727e-03 -3.46032765e+01 2.24300964e+02
1716.lowfreq: -0.0007 -0.0006 -0.0002 2.6135 7.6982 9.1370 20.6043 28.3588 31.7862
frequency: 20.5692 28.2825 31.6229 40.4403 58.6265 62.2691 73.5723 81.1193 93.7494 112.3136 126.8362 143.0507 147.2013 163.1128 170.9814 188.5009 219.7948 227.8151 232.9241 233.2749 240.4370 269.6213 304.5310 325.3298 341.4166 377.8414 401.6745 405.0973 429.0313 459.7072 469.6635 471.4955 491.9272 533.2160 559.7263 604.3061 626.6411 649.6489 674.8776 697.2380 710.6899 735.4297 735.9495 780.8878 784.4543 785.6455 789.8107 794.7520 805.2148 826.7749 860.5402 888.9162 898.6058 901.7851 922.7939 924.7844 940.6856 945.6174 976.4792 997.2296 1001.8900 1008.8355 1020.1055 1032.4796 1069.2104 1071.6203 1073.8711 1086.3077 1100.4422 1110.8321 1113.8493 1114.7252 1138.7508 1152.8089 1165.2907 1175.6348 1187.9264 1194.7376 1211.6441 1237.0919 1239.0245 1249.8055 1267.4767 1268.5632 1270.5918 1285.4217 1289.3364 1295.1495 1305.8764 1340.2424 1345.5855 1356.0413 1359.0137 1362.4677 1376.5120 1389.7086 1390.7867 1401.2463 1417.2710 1431.8839 1439.3332 1457.8376 1460.8020 1465.5985 1468.7582 1469.1831 1473.5441 1476.2176 1476.8855 1477.4254 1478.5953 1484.3559 1488.6565 1493.5249 1517.0596 1560.9628 1584.3222 1597.4624 1627.7332 2926.2832 2961.6014 2962.3341 2962.9064 2970.4351 2973.6011 2974.9179 2983.7350 2985.5030 3004.8303 3005.5352 3030.5687 3033.5030 3051.7030 3054.6584 3069.8846 3072.5036 3072.6587 3074.2042 3085.3417 3125.5502 3125.7716 3143.5396 3148.3088 3158.9586 3169.2811 3174.5028 3326.4113
redmass: 4.0248 4.1059 3.8150 4.0722 2.2930 2.3126 1.9362 2.4752 3.3355 2.4590 3.3857 3.2962 2.9295 3.4949 3.3229 3.5210 3.2253 2.7784 1.1176 1.2253 1.3690 2.7697 4.5921 3.7297 3.8545 2.7336 2.7363 3.6457 3.1060 4.9685 4.8795 3.4668 4.4208 3.9672 5.5453 4.6830 3.0503 3.6764 4.3956 5.2081 3.5252 1.0781 1.0987 1.4453 1.9924 1.6962 1.3131 2.2147 1.8222 1.4775 3.3244 1.5804 1.7602 1.7582 1.2589 1.4502 1.4181 3.3492 1.3683 1.3236 3.8976 3.9256 3.4547 2.3805 2.5316 3.3291 2.4932 1.9174 1.8095 2.2348 1.2597 2.3297 1.5155 1.5256 1.5551 1.1194 1.8776 2.1499 1.5249 1.6646 2.2619 1.5670 1.4799 1.2854 1.4635 1.0813 1.0914 1.3200 1.3836 1.4409 1.4782 1.7271 2.4127 1.6304 1.7352 1.2182 1.2387 2.2450 7.7317 1.5467 1.9128 2.0998 1.0964 1.0504 1.0800 1.0670 1.1024 1.1158 1.0431 1.0421 1.0666 1.0961 1.0861 1.1361 3.9427 5.1705 6.3708 6.7665 6.8085 1.0700 1.0590 1.0327 1.0588 1.0595 1.0369 1.0365 1.0607 1.0696 1.0989 1.0975 1.0946 1.1006 1.1040 1.1003 1.1004 1.1006 1.0995 1.0997 1.0961 1.0867 1.0988 1.0900 1.0881 1.0960 1.0951 1.0971 1.0745
irintensity: 0.3395 0.1948 0.1658 0.4735 1.0611 0.9064 1.0399 0.4083 3.1095 0.1931 1.7645 4.7806 0.0804 0.0620 0.2315 5.3961 0.7290 1.8516 0.0159 0.0450 0.1520 0.1389 2.4564 3.5336 0.8594 1.9010 0.4708 1.8694 6.9291 0.7894 10.1502 2.7584 4.5329 8.5382 1.4784 21.4633 5.7970 0.6792 3.3306 15.0401 4.3391 10.5057 8.7253 74.3772 4.8318 18.3971 4.4209 7.4894 30.9635 56.6423 8.1169 1.3480 4.1444 15.0778 7.5009 6.5759 6.2618 7.4894 2.1319 0.6864 5.6857 7.1227 8.4446 15.7971 2.9138 131.0174 0.6498 28.7058 29.1770 20.5082 0.0922 11.3421 31.8794 8.7417 45.3784 2.8052 4.7497 8.5019 22.0312 5.9304 138.6710 6.5228 31.4973 2.5680 28.1295 0.7287 5.6387 52.6537 19.3928 26.4208 0.7570 37.0435 34.8055 10.6885 65.4526 9.7608 16.1339 60.3740 4.2083 7.2731 20.2425 43.4465 5.6850 13.9516 2.0214 0.2563 1.6517 25.1861 11.7832 12.6995 6.6901 0.8130 22.6740 17.2680 39.6400 121.4323 90.4323 17.2738 4.0633 31.9906 32.7551 78.4526 7.9761 27.3501 46.9963 31.1139 40.2139 48.8539 9.7016 2.8364 3.1840 30.7513 43.7186 27.9388 55.4770 53.2193 73.0398 61.4217 38.8326 1.6798 27.9873 13.8126 7.6424 18.5056 14.5536 16.0474 50.1291
temp: 298.150 k
press: 1.00000 atm
elementType: 8 7 7 6 6 6 6 6 6 6 6 6 6 6 6 6 6 6 6 6 6 6 6 1 1 1 1 1 1 1 1 1 1 1 1 1 1 1 1 1 1 1 1 1 1 1 1 1 1 1 1
symmnumber: 1
zpe: 1147421.4 jmol-1
zpe.correction: 0.437030 hartree
zpe.thermalcorrener: 0.461424 hartree
zpe.thermalcorrenthalpy: 0.462368 hartree
zpe.thermalcorrgfe: 0.381007 hartree
zpe.sumelectzpe: -961.898292 hartree
zpe.sumelectthermal: -961.873898 hartree
zpe.sumelectthermalent: -961.872954 hartree
zpe.sumelectthermalfe: -961.954315 hartree
dipole: 0.3785 2.8141 1.5883
dipole: 3.2534
quadrupole: -112.7836 -140.8223 -141.5315
quadrupole: -3.5050 8.6914 -8.2009
quadrupole: 18.9289 -9.1098 -9.8190 -3.5050 8.6914 -8.2009
hfenergy: -962.335322 hartree
pointgroup: C01 [X(C20H28N2O1)]
dipole: 0.2105686 1.0508712 0.699808 debye
polarizability: 297.6751288|-12.3753113|210.0160048|-3.1528995|-35.4940667|219.3543126 unknown
InChI: InChI=1S/C20H28N2O/c1-4-6-14-22(15-7-5-2)20(21)18-12-13-19(23-3)17-11-9-8-10-16(17)18/h8-13,21H,4-7,14-15H2,1-3H3
charge 0 multiplicity 1
51 atoms
O  -4.650674 0.018456 -0.131954
N  1.921891 0.390677 -0.01074
N  1.397052 -0.425466 -2.251297
C  3.380603 0.278136 -0.229335
C  1.48295 1.301242 1.075417
C  3.907209 -1.172128 -0.09955
C  1.58271 2.801429 0.705644
C  1.046671 -0.022131 -1.040236
C  -0.432306 -0.016731 -0.745493
C  5.411011 -1.276429 -0.438022
C  1.184671 3.719984 1.883279
C  -1.030776 -0.779135 0.329899
C  -2.468135 -0.74673 0.512445
C  -1.263456 0.700389 -1.610724
C  5.95953 -2.710687 -0.277078
C  1.277483 5.219806 1.528512
C  -3.272464 0.040306 -0.392319
C  -0.260044 -1.604404 1.217749
C  -2.67818 0.745636 -1.444845
C  -3.070344 -1.506589 1.565849
C  -0.870856 -2.344074 2.23308
C  -2.287043 -2.291298 2.415675
C  -5.521188 0.772636 -1.036104
H  3.667163 0.690738 -1.222449
H  3.882349 0.915133 0.521454
H  0.442029 1.063772 1.347458
H  2.10176 1.096372 1.971877
H  3.328822 -1.840801 -0.765796
H  3.731212 -1.525732 0.935931
H  0.922533 2.999357 -0.16251
H  2.616462 3.042215 0.382607
H  5.98613 -0.585282 0.212331
H  5.575902 -0.932953 -1.480141
H  1.8378 3.505076 2.754378
H  0.150676 3.477651 2.202327
H  -0.803458 1.226249 -2.453171
H  5.841919 -3.065943 0.763835
H  7.033593 -2.763855 -0.532975
H  5.419265 -3.416743 -0.935058
H  0.610839 5.468025 0.68146
H  0.987911 5.856541 2.384538
H  2.30822 5.49504 1.235227
H  0.824653 -1.649918 1.077202
H  -3.276624 1.329614 -2.149414
H  -4.156861 -1.463396 1.680882
H  2.419674 -0.361354 -2.433434
H  -0.261911 -2.973364 2.892009
H  -2.756461 -2.873256 3.216457
H  -6.539759 0.617756 -0.651178
H  -5.448979 0.389058 -2.072136
H  -5.274877 1.852106 -1.022163
