program: Orca
programVersion: 5.0.2
elementType: C C C C C C I I I N H N H C O O H C O C O C H H H C H H H H
elementType: I
charge: 1
multiplicity: 1
keywords: wB97X-D3 TightOpt Freq def2-TZVPP def2/J RIJCOSX TightSCF defgrid3 CHELPG
frequency: 0.00 0.00 0.00 0.00 0.00 0.00 19.98 27.39 40.10 41.63 45.99 47.79 60.24 67.57 81.64 87.72 100.32 103.51 133.88 137.70 173.82 191.38 202.94 231.00 236.73 275.48 323.46 348.94 359.82 373.80 413.24 432.67 446.47 500.84 508.62 537.49 556.92 585.37 595.64 601.33 613.00 656.97 673.56 675.44 700.80 731.22 759.26 799.87 821.99 845.60 859.45 1014.62 1025.61 1026.78 1059.42 1061.78 1094.49 1126.16 1212.18 1227.74 1248.73 1301.15 1302.75 1312.98 1382.12 1389.70 1408.67 1414.99 1457.99 1464.54 1465.05 1471.29 1486.26 1488.41 1549.61 1559.24 1569.09 1627.34 1842.36 1846.60 3070.52 3071.39 3140.49 3141.12 3199.18 3200.44 3464.79 3614.03 3623.68 3753.29
frequency: 19.98 27.39 40.10 41.63 45.99 47.79 60.24 67.57 81.64 87.72 100.32 103.51 133.88 137.70 173.82 191.38 202.94 231.00 236.73 275.48 323.46 348.94 359.82 373.80 413.24 432.67 446.47 500.84 508.62 537.49 556.92 585.37 595.64 601.33 613.00 656.97 673.56 675.44 700.80 731.22 759.26 799.87 821.99 845.60 859.45 1014.62 1025.61 1026.78 1059.42 1061.78 1094.49 1126.16 1212.18 1227.74 1248.73 1301.15 1302.75 1312.98 1382.12 1389.70 1408.67 1414.99 1457.99 1464.54 1465.05 1471.29 1486.26 1488.41 1549.61 1559.24 1569.09 1627.34 1842.36 1846.60 3070.52 3071.39 3140.49 3141.12 3199.18 3200.44 3464.79 3614.03 3623.68 3753.29
formula: C11H10I3N2O4
InChI: InChI=1S/C11H10I3N2O4/c1-3(17)15-9-6(12)5(11(19)20)7(13)10(8(9)14)16-4(2)18/h15-16,19-20H,1-2H3
30 atoms
C  1.218877 0.512675 -0.301669
C  0.002285 1.201542 -0.418061
C  -1.227958 0.529693 -0.340931
C  -1.23818 -0.865119 -0.282571
C  -0.020353 -1.584887 -0.296415
C  1.19949 -0.879585 -0.229446
I  3.075028 -1.799469 -0.051186
I  -3.096004 -1.766165 0.042386
I  0.03083 3.251869 -0.719202
N  2.445022 1.198403 -0.29089
H  2.837827 1.49153 -1.173606
N  -2.429628 1.251075 -0.345854
H  -2.989065 1.255182 -1.185461
C  -0.045966 -3.036757 -0.451225
O  0.715068 -3.877022 0.138814
O  -0.890964 -3.541641 -1.268989
H  -0.867846 -4.511257 -1.272328
C  3.017988 1.832067 0.813592
O  3.98892 2.520983 0.659548
C  -3.047221 1.85446 0.748035
O  -4.112506 2.389289 0.600808
C  2.366252 1.574404 2.146323
H  2.273696 0.505982 2.346983
H  2.973604 2.035869 2.918076
H  1.366333 2.011318 2.173758
C  -2.31786 1.776659 2.063419
H  -2.041656 0.749612 2.307213
H  -1.408217 2.378481 2.033369
H  -2.970637 2.168766 2.836544
H  1.446939 -3.454495 0.637829
totalener: -1728.76594360 hartree
nucrepener: 2470.53183873 hartree
electener: -4199.29778232 hartree
oneelecener: -7587.16093252 hartree
twoeener: 3387.86315019 hartree
kineticenergy: 1172.09661007 hartree
xcener: -123.737422415727 hartree
chargesum: 1.0000000
charge: 0.170779 -0.334650 0.120362 -0.174166 0.095709 -0.178191 0.198707 0.205346 0.269492 -0.281585 0.198705 -0.247887 0.193554 0.443119 -0.165556 -0.147346 0.258136 0.251673 -0.302595 0.259068 -0.307394 -0.185486 0.083116 0.137122 0.085401 -0.197757 0.085066 0.089426 0.136674 0.241156
charge: -0.224064 -0.290966 -0.219126 -0.284438 -0.161996 -0.284272 0.569224 0.515389 0.557419 0.298172 -0.008376 0.305605 -0.007709 -0.273664 0.483512 0.502917 -0.032048 -0.400104 0.136258 -0.399257 0.133082 0.025648 0.017765 0.038431 0.021470 0.024222 0.018181 0.017717 0.038133 -0.117122
qa: 0.1708 -0.3346 0.1204 -0.1742 0.0957 -0.1782 0.1987 0.2053 0.2695 -0.2816 0.1987 -0.2479 0.1936 0.4431 -0.1656 -0.1473 0.2581 0.2517 -0.3026 0.2591 -0.3074 -0.1855 0.0831 0.1371 0.0854 -0.1978 0.0851 0.0894 0.1367 0.2412
va: 3.4901 4.2355 3.5122 4.1539 3.3860 4.1890 1.4580 1.3670 1.4353 3.0014 1.0073 3.0169 1.0091 4.0890 2.3855 2.4043 1.0002 4.1822 2.1931 4.1767 2.1907 3.8377 1.0020 1.0225 1.0029 3.8298 1.0015 1.0067 1.0235 1.0792
dispcorr: -0.021136544 hartree
energy: -1728.790778182929
dipole: -1.42740 1.89769 0.47029 25.06794 -29.33042 -4.26248 48.12590 -48.38545 -0.25954
magnitude: 4.29619 au
magnitude: 10.92006 debye
temp: 298.15 k
press: 1.00 atm
zeropoint: 0.20445441 hartree
thermalvibcorrection: 0.01939507 hartree
thermalrotcorrection: 0.00141627 hartree
thermaltrasncorrection: 0.00141627 hartree
thermaltotal: -1728.56409616 hartree
thermalcorr: 0.02222761 hartree
nonthermalcorr: 0.20445441 hartree
totalcorr: 0.22668202 hartree
thermalcorrenthalpy: 0.00094421 hartree
totalenthalpy: -1728.56315195 hartree
totalentropycorr: -0.07487021 hartree
gibbsenthalpy: -1728.63802216 hartree
gibbsminuselec: 0.15275602 hartree
