program: Orca
programVersion: 5.0.2
elementType: C C C C C H H H C C C H H C H H C H C H H H C H C H C H H C O O H C H H C C C H H H O H C O C H H O P O O H O H F H C H H H H
charge: 1
multiplicity: 1
keywords: wB97X-D3 TightOpt Freq def2-TZVPP def2/J RIJCOSX TightSCF defgrid3 CHELPG
frequency: 0.00 0.00 0.00 0.00 0.00 0.00 26.18 30.04 46.93 53.40 63.22 78.81 97.94 106.71 124.23 133.62 146.74 161.42 169.48 187.94 195.22 198.24 216.63 219.36 236.77 237.44 247.29 256.30 260.22 266.88 280.53 292.12 305.10 317.16 326.79 330.26 340.21 352.20 371.03 376.58 382.25 390.57 397.12 408.61 421.85 443.97 449.78 459.69 469.29 473.93 487.55 488.23 497.36 508.59 518.96 521.14 531.13 539.00 550.17 552.95 591.97 621.53 623.88 634.80 687.70 697.62 712.58 724.12 742.34 786.42 794.48 808.53 813.37 841.22 859.06 891.67 907.26 911.09 921.56 930.54 933.46 939.90 949.63 965.77 968.52 976.83 990.17 995.05 997.04 1008.08 1011.79 1016.56 1029.38 1053.50 1057.23 1068.02 1077.54 1090.34 1096.00 1098.37 1102.43 1112.47 1132.97 1139.47 1142.69 1154.78 1168.07 1172.07 1188.93 1196.09 1205.07 1206.63 1212.90 1219.49 1230.19 1233.70 1252.90 1270.51 1280.47 1295.24 1298.35 1310.52 1323.50 1330.62 1337.10 1340.78 1352.75 1367.84 1370.53 1376.53 1387.21 1390.41 1403.07 1407.80 1410.72 1415.04 1425.36 1427.72 1428.76 1439.72 1445.41 1451.39 1476.65 1485.53 1497.93 1499.33 1503.67 1504.78 1505.56 1508.96 1513.87 1521.92 1539.31 1552.08 1555.41 1612.59 1711.97 1789.99 3019.57 3062.39 3064.20 3066.14 3068.63 3081.84 3084.77 3086.74 3089.14 3090.24 3092.86 3103.32 3125.30 3132.68 3133.40 3137.10 3143.49 3161.76 3164.94 3167.56 3174.23 3176.49 3203.11 3217.01 3220.32 3227.52 3783.61 3803.87 3829.94 3877.73 3907.97
frequency: 26.18 30.04 46.93 53.40 63.22 78.81 97.94 106.71 124.23 133.62 146.74 161.42 169.48 187.94 195.22 198.24 216.63 219.36 236.77 237.44 247.29 256.30 260.22 266.88 280.53 292.12 305.10 317.16 326.79 330.26 340.21 352.20 371.03 376.58 382.25 390.57 397.12 408.61 421.85 443.97 449.78 459.69 469.29 473.93 487.55 488.23 497.36 508.59 518.96 521.14 531.13 539.00 550.17 552.95 591.97 621.53 623.88 634.80 687.70 697.62 712.58 724.12 742.34 786.42 794.48 808.53 813.37 841.22 859.06 891.67 907.26 911.09 921.56 930.54 933.46 939.90 949.63 965.77 968.52 976.83 990.17 995.05 997.04 1008.08 1011.79 1016.56 1029.38 1053.50 1057.23 1068.02 1077.54 1090.34 1096.00 1098.37 1102.43 1112.47 1132.97 1139.47 1142.69 1154.78 1168.07 1172.07 1188.93 1196.09 1205.07 1206.63 1212.90 1219.49 1230.19 1233.70 1252.90 1270.51 1280.47 1295.24 1298.35 1310.52 1323.50 1330.62 1337.10 1340.78 1352.75 1367.84 1370.53 1376.53 1387.21 1390.41 1403.07 1407.80 1410.72 1415.04 1425.36 1427.72 1428.76 1439.72 1445.41 1451.39 1476.65 1485.53 1497.93 1499.33 1503.67 1504.78 1505.56 1508.96 1513.87 1521.92 1539.31 1552.08 1555.41 1612.59 1711.97 1789.99 3019.57 3062.39 3064.20 3066.14 3068.63 3081.84 3084.77 3086.74 3089.14 3090.24 3092.86 3103.32 3125.30 3132.68 3133.40 3137.10 3143.49 3161.76 3164.94 3167.56 3174.23 3176.49 3203.11 3217.01 3220.32 3227.52 3783.61 3803.87 3829.94 3877.73 3907.97
formula: C22H31FO8P
InChI: InChI=1S/C22H31FO8P/c1-12-8-16-15-5-4-13-9-14(24)6-7-19(13,2)21(15,23)17(25)10-20(16,3)22(12,27)18(26)11-31-32(28,29)30/h6-7,9,12,15-17,24-25,27-29H,4-5,8,10-11H2,1-3H3
63 atoms
C  4.910224 -2.18249 -0.786659
C  3.76694 -2.010911 -0.108233
C  4.451037 0.315349 0.495732
C  5.601823 0.123685 -0.192577
C  5.838553 -1.102122 -0.845137
H  5.145034 -3.117381 -1.281125
H  3.054857 -2.82377 -0.026638
H  6.352374 0.898072 -0.276915
C  3.413389 -0.760325 0.609908
C  2.091675 -0.149565 -0.012694
C  4.14338 1.61278 1.156876
H  4.939908 2.330634 0.968395
H  4.113774 1.445497 2.237648
C  2.788715 2.164493 0.689392
H  2.523653 3.016691 1.314168
H  2.888267 2.536187 -0.331456
C  1.668286 1.127016 0.736516
H  1.476936 0.855337 1.776362
C  3.296322 -1.156774 2.112857
H  2.611734 -1.988818 2.229039
H  4.280303 -1.437891 2.48858
H  2.92862 -0.326282 2.708171
C  0.978693 -1.191508 -0.285138
H  1.353123 -1.79626 -1.120231
C  0.386851 1.666955 0.113945
H  0.610884 1.875191 -0.933854
C  -0.33141 -0.553268 -0.744053
H  -0.195809 -0.215104 -1.771342
H  -1.103661 -1.328688 -0.756769
C  -0.747944 0.633354 0.114146
O  6.95845 -1.204207 -1.503257
O  0.832208 -2.01778 0.853396
H  -0.048498 -2.398111 0.850264
C  -0.259748 2.929268 0.696066
H  -0.158007 2.969925 1.782904
H  0.19363 3.836709 0.29754
C  -1.850838 1.536768 -0.553287
C  -1.760283 2.836789 0.287589
C  -1.115161 0.19105 1.538128
H  -1.860413 -0.602164 1.516676
H  -0.249479 -0.215052 2.054552
H  -1.489212 1.01068 2.149821
O  -1.474529 1.823411 -1.87653
H  -2.051184 1.308241 -2.45246
C  -3.208136 0.844966 -0.618791
O  -3.547302 0.349853 -1.672248
C  -4.129244 0.769786 0.581298
H  -4.647954 1.729879 0.64979
H  -3.570347 0.626773 1.502656
O  -5.11788 -0.222486 0.433078
P  -4.689728 -1.739229 0.153598
O  -3.283883 -1.986414 0.469527
O  -5.172313 -2.01306 -1.32201
H  -4.826437 -1.340907 -1.922833
O  -5.684136 -2.605007 1.001015
H  -6.581219 -2.649168 0.663883
F  2.48422 0.247291 -1.30284
H  7.061761 -2.059762 -1.934363
C  -2.287998 4.065637 -0.435434
H  -2.233171 4.938631 0.215238
H  -1.711199 4.266233 -1.33623
H  -3.331208 3.939705 -0.732697
H  -2.354054 2.698483 1.192902
totalener: -1900.08989442 hartree
nucrepener: 3961.57458148 hartree
electener: -5861.66447590 hartree
twoeener: 4601.67357336 hartree
kineticenergy: 1891.63865945 hartree
xcener: -162.621278262777 hartree
chargesum: 1.0000000
charge: -0.142169 -0.224937 -0.157552 -0.060189 0.357211 0.135765 0.176100 0.136110 0.415909 0.374408 -0.179395 0.098444 0.128020 -0.215932 0.101170 0.121445 -0.172883 0.111275 -0.336804 0.149863 0.138824 0.107761 0.045944 0.122702 -0.237253 0.141445 -0.439434 0.122749 0.114308 0.713959 -0.174467 -0.342448 0.191179 -0.304631 0.099903 0.102717 0.225215 -0.062827 -0.549128 0.153212 0.107688 0.113469 -0.369470 0.190331 0.214412 -0.419243 0.002334 0.118094 0.138177 -0.325241 0.919002 -0.548633 -0.338739 0.238438 -0.315597 0.215105 -0.231462 0.225653 -0.301332 0.104885 0.101762 0.081415 0.093370
charge: 0.004272 0.125936 0.055375 0.025373 -0.107093 0.034912 0.052262 0.043581 -0.109261 -0.173172 0.020335 0.039169 0.045553 0.016646 0.034484 0.035564 -0.053535 0.035982 0.077664 0.023039 0.029112 0.018416 -0.162661 0.025212 -0.051290 0.043378 0.004350 0.036281 0.034173 -0.116640 0.478487 0.306329 -0.117647 0.023022 0.020602 0.024653 -0.218453 -0.059998 0.031924 0.012209 0.007258 0.012650 0.332512 -0.148996 -0.219971 0.158863 -0.118525 0.041225 0.024354 0.117883 0.124039 -0.244270 0.177709 -0.132661 0.209743 -0.115195 0.153969 -0.062260 0.016480 0.018147 0.019108 0.015295 0.024099
qa: -0.1422 -0.2249 -0.1576 -0.0602 0.3572 0.1358 0.1761 0.1361 0.4159 0.3744 -0.1794 0.0984 0.1280 -0.2159 0.1012 0.1214 -0.1729 0.1113 -0.3368 0.1499 0.1388 0.1078 0.0459 0.1227 -0.2373 0.1414 -0.4394 0.1227 0.1143 0.7140 -0.1745 -0.3424 0.1912 -0.3046 0.0999 0.1027 0.2252 -0.0628 -0.5491 0.1532 0.1077 0.1135 -0.3695 0.1903 0.2144 -0.4192 0.0023 0.1181 0.1382 -0.3252 0.9190 -0.5486 -0.3387 0.2384 -0.3156 0.2151 -0.2315 0.2257 -0.3013 0.1049 0.1018 0.0814 0.0934
va: 3.9681 4.0165 3.8653 3.8828 3.9662 1.0090 1.0125 1.0164 3.6573 3.8706 3.9964 1.0214 0.9955 3.9178 1.0200 1.0061 3.9689 0.9902 3.8936 1.0193 0.9948 1.0037 4.0211 0.9971 3.9291 1.0394 3.9946 1.0454 1.0500 3.0531 2.3827 2.0764 1.0471 4.0021 1.0084 1.0100 4.0897 3.8717 3.9671 1.0337 1.0235 0.9910 2.1073 1.0735 3.7683 2.0328 3.9756 0.9899 0.9955 2.0879 5.6374 2.0331 2.1882 1.0435 2.2518 1.0362 1.0827 1.0178 4.0136 1.0014 1.0104 1.0062 1.0129
dispcorr: -0.044787805 hartree
energy: -1900.140647635392
dipole: 14.91666 -9.57950 5.33717 19.02791 -19.55046 -0.52255 12.67223 -12.40059 0.27164
magnitude: 5.36956 au
magnitude: 13.64834 debye
temp: 298.15 k
press: 1.00 atm
zeropoint: 0.52854799 hartree
thermalvibcorrection: 0.02735047 hartree
thermalrotcorrection: 0.00141627 hartree
thermaltrasncorrection: 0.00141627 hartree
thermaltotal: -1899.58191663 hartree
thermalcorr: 0.03018301 hartree
nonthermalcorr: 0.52854799 hartree
totalcorr: 0.55873101 hartree
thermalcorrenthalpy: 0.00094421 hartree
totalenthalpy: -1899.58097242 hartree
totalentropycorr: -0.08540121 hartree
gibbsenthalpy: -1899.66637363 hartree
gibbsminuselec: 0.47427401 hartree
