program: Orca
programVersion: 5.0.2
elementType: Cl O O O O O O O O N N C C C C C C C C C C C C C C C C C C C C C H H H H H H H H H H H H H H H H H H H H H H
charge: 1
multiplicity: 1
keywords: wB97X-D3 TightOpt Freq def2-TZVPP def2/J RIJCOSX TightSCF defgrid3 CHELPG
frequency: 0.00 0.00 0.00 0.00 0.00 0.00 23.94 32.90 39.81 59.30 68.33 75.64 82.89 93.61 102.66 122.14 123.69 147.48 150.30 166.42 177.36 192.96 202.48 210.46 232.00 242.53 261.99 271.19 281.84 296.82 306.33 321.82 330.57 337.82 340.07 344.56 345.72 356.27 367.78 400.10 412.72 431.30 444.87 453.38 455.39 465.03 486.01 499.56 513.06 519.34 541.78 558.76 566.89 574.00 590.63 601.85 620.88 641.21 645.87 671.17 678.65 696.77 705.72 729.49 741.28 750.25 779.57 785.02 800.20 821.81 833.04 860.22 879.22 890.42 906.21 945.28 967.39 977.18 998.54 1015.65 1020.13 1024.20 1041.63 1047.22 1064.01 1070.16 1080.21 1086.62 1119.04 1123.90 1140.53 1161.89 1167.13 1179.93 1185.83 1197.70 1218.76 1223.95 1230.81 1245.68 1265.85 1268.27 1287.08 1297.76 1314.44 1322.06 1333.10 1334.79 1354.44 1360.40 1370.55 1389.37 1394.68 1398.78 1407.43 1410.21 1416.85 1422.35 1438.93 1442.87 1456.19 1460.94 1485.70 1487.70 1491.42 1500.67 1501.51 1503.88 1509.78 1516.79 1530.80 1536.01 1622.76 1634.77 1637.77 1665.52 1689.74 1729.53 1785.43 1827.44 3022.04 3026.25 3069.88 3079.61 3083.43 3087.39 3101.33 3129.48 3133.80 3169.95 3195.18 3198.30 3211.19 3225.89 3240.85 3357.87 3608.96 3639.03 3775.21 3786.79 3803.45 3898.18
frequency: 23.94 32.90 39.81 59.30 68.33 75.64 82.89 93.61 102.66 122.14 123.69 147.48 150.30 166.42 177.36 192.96 202.48 210.46 232.00 242.53 261.99 271.19 281.84 296.82 306.33 321.82 330.57 337.82 340.07 344.56 345.72 356.27 367.78 400.10 412.72 431.30 444.87 453.38 455.39 465.03 486.01 499.56 513.06 519.34 541.78 558.76 566.89 574.00 590.63 601.85 620.88 641.21 645.87 671.17 678.65 696.77 705.72 729.49 741.28 750.25 779.57 785.02 800.20 821.81 833.04 860.22 879.22 890.42 906.21 945.28 967.39 977.18 998.54 1015.65 1020.13 1024.20 1041.63 1047.22 1064.01 1070.16 1080.21 1086.62 1119.04 1123.90 1140.53 1161.89 1167.13 1179.93 1185.83 1197.70 1218.76 1223.95 1230.81 1245.68 1265.85 1268.27 1287.08 1297.76 1314.44 1322.06 1333.10 1334.79 1354.44 1360.40 1370.55 1389.37 1394.68 1398.78 1407.43 1410.21 1416.85 1422.35 1438.93 1442.87 1456.19 1460.94 1485.70 1487.70 1491.42 1500.67 1501.51 1503.88 1509.78 1516.79 1530.80 1536.01 1622.76 1634.77 1637.77 1665.52 1689.74 1729.53 1785.43 1827.44 3022.04 3026.25 3069.88 3079.61 3083.43 3087.39 3101.33 3129.48 3133.80 3169.95 3195.18 3198.30 3211.19 3225.89 3240.85 3357.87 3608.96 3639.03 3775.21 3786.79 3803.45 3898.18
formula: C21H22ClN2O8
InChI: InChI=1S/C21H22ClN2O8/c1-24(2)14-7-5-6-10(16(27)12-9(25)4-3-8(22)11(12)15(6)26)18(29)21(7,32)19(30)13(17(14)28)20(23)31/h3-4,6-7,14-15,24-27,30,32H,5,23H2,1-2H3
54 atoms
Cl 4.619832 -3.007726 0.61629
O  -2.272846 1.569744 -1.698311
O  1.634169 -1.154568 1.641228
O  -0.251156 2.799683 -0.45654
O  -2.317062 2.210803 1.187589
O  2.222563 2.780949 -0.195313
O  -3.569686 -2.27916 1.005403
O  4.83993 2.737999 -0.443552
O  -5.342608 0.189507 1.859576
N  -3.867542 -0.670413 -1.845688
N  -3.738465 0.576877 3.407595
C  -1.433719 -0.588282 -1.156489
C  -1.549988 0.861815 -0.689667
C  -0.347872 -1.331883 -0.377832
C  1.020491 -0.703869 -0.610929
C  -2.773854 -1.304671 -1.007528
C  0.988412 0.794042 -0.451818
C  -0.187573 1.539175 -0.526666
C  2.075296 -1.308159 0.304473
C  -2.3493 1.015888 0.61102
C  -3.194834 -1.272856 0.462833
C  -3.138525 0.042422 1.103045
C  3.413622 -0.628221 0.104427
C  2.193256 1.469423 -0.260368
C  3.452186 0.768858 -0.13594
C  -5.240863 -1.02453 -1.370858
C  -3.706632 -0.997245 -3.28687
C  4.597365 -1.314407 0.241303
C  -4.172956 0.280405 2.174789
C  4.692093 1.431187 -0.234062
C  5.825207 -0.658692 0.107529
C  5.87184 0.688714 -0.129797
H  -1.139514 -0.548763 -2.208037
H  -0.326635 -2.378127 -0.688333
H  -0.565884 -1.322739 0.691255
H  1.341349 -0.936113 -1.634193
H  -2.710848 -2.347317 -1.317535
H  2.176388 -2.367385 0.058301
H  -2.04107 2.504186 -1.642472
H  -2.721853 -0.690647 -3.624295
H  -3.838838 -2.068538 -3.41894
H  -5.329596 -2.108043 -1.338875
H  -5.410508 -0.607123 -0.37783
H  -5.957269 -0.607824 -2.073571
H  -4.463534 -0.459509 -3.851399
H  2.237505 -1.615423 2.22598
H  -1.652507 2.778738 0.76012
H  1.283166 3.114842 -0.295802
H  6.741096 -1.225982 0.20467
H  6.814289 1.209569 -0.22548
H  -2.762683 0.670477 3.614312
H  -4.414603 0.767175 4.126336
H  3.986592 3.185267 -0.422348
H  -3.743869 0.345685 -1.75901
totalener: -1984.96202578 hartree
nucrepener: 3686.44196885 hartree
electener: -5671.40399463 hartree
twoeener: 4354.71602336 hartree
kineticenergy: 1976.97196669 hartree
xcener: -162.925426036952 hartree
chargesum: 1.0000000
charge: -0.039521 -0.356590 -0.313040 -0.526468 -0.258625 -0.313957 -0.246614 -0.265080 -0.386315 0.115165 -0.218599 0.021164 0.420967 -0.476452 0.266769 0.001393 -0.319762 0.247914 -0.010076 0.129156 0.124360 -0.281123 -0.033607 0.338707 -0.072021 -0.192862 -0.179477 0.025360 0.353378 0.219727 -0.070692 -0.157685 0.102875 0.109191 0.153549 0.103248 0.148037 0.120708 0.207874 0.137022 0.133157 0.142541 0.167751 0.122200 0.133825 0.187562 0.225917 0.237119 0.138708 0.143609 0.169018 0.175134 0.214425 0.181032
charge: 0.433613 0.324835 0.306956 0.123233 0.411649 0.432073 0.193634 0.404372 0.094493 0.448892 0.386991 -0.049513 -0.213427 0.025801 -0.057811 -0.034346 -0.091624 -0.228825 -0.161675 -0.165212 -0.292354 -0.101854 -0.061803 -0.100547 -0.061698 0.080986 0.067067 -0.384394 -0.391472 -0.157766 0.007008 0.018608 0.043860 0.038462 0.040094 0.050040 0.050539 0.020733 -0.118137 0.022330 0.030415 0.032430 0.029720 0.024685 0.029547 -0.123635 -0.126720 -0.161193 0.037978 0.038668 -0.020447 -0.009271 -0.144307 0.008319
qa: -0.0395 -0.3566 -0.3130 -0.5265 -0.2586 -0.3140 -0.2466 -0.2651 -0.3863 0.1152 -0.2186 0.0212 0.4210 -0.4765 0.2668 0.0014 -0.3198 0.2479 -0.0101 0.1292 0.1244 -0.2811 -0.0336 0.3387 -0.0720 -0.1929 -0.1795 0.0254 0.3534 0.2197 -0.0707 -0.1577 0.1029 0.1092 0.1535 0.1032 0.1480 0.1207 0.2079 0.1370 0.1332 0.1425 0.1678 0.1222 0.1338 0.1876 0.2259 0.2371 0.1387 0.1436 0.1690 0.1751 0.2144 0.1810
va: 1.2944 2.0440 2.0995 1.9717 2.2713 2.2340 2.2190 2.2585 2.1258 3.6825 3.2659 3.8373 3.9296 4.0623 3.6010 3.8299 3.6643 3.9315 4.1732 4.0849 4.2058 3.6087 3.6112 3.8893 3.5266 3.8101 3.8615 3.9801 4.2412 4.0811 4.0163 3.9675 1.0226 1.0193 1.0198 1.0118 1.0096 1.0015 1.0539 1.0012 0.9969 0.9999 1.0388 0.9971 0.9982 1.0458 1.0685 1.1012 1.0050 1.0107 1.0194 1.0208 1.0700 1.0420
dispcorr: -0.035512871 hartree
energy: -1985.002408186448
dipole: -28.51532 27.10969 -1.40563 -0.33531 0.24925 -0.08606 -13.79136 11.25189 -2.53947
magnitude: 2.90381 au
magnitude: 7.38090 debye
temp: 298.15 k
press: 1.00 atm
zeropoint: 0.43021685 hartree
thermalvibcorrection: 0.02557331 hartree
thermalrotcorrection: 0.00141627 hartree
thermaltrasncorrection: 0.00141627 hartree
thermaltotal: -1984.54378549 hartree
thermalcorr: 0.02840585 hartree
nonthermalcorr: 0.43021685 hartree
totalcorr: 0.45862270 hartree
thermalcorrenthalpy: 0.00094421 hartree
totalenthalpy: -1984.54284128 hartree
totalentropycorr: -0.08304072 hartree
gibbsenthalpy: -1984.62588200 hartree
gibbsminuselec: 0.37652619 hartree
