program: Gaussian 09
title: 000044723
version: EM64L-G09RevD.01
frameworkgroup: C1[X(C17H26N2O3S)]
method: RPBEPBE
basis: SDD
operation: Freq
keyword: #p
keyword: freq=noraman
keyword: PBEPBE/SDD
title: #p freq=noraman PBEPBE/SDD
converged: YES YES NO NO
title: Mulliken charges:
elementType: S O O O N N C C C C C C C C C C C C C C C C C H H H H H H H H H H H H H H H H H H H H H H H H H H
charge: 0.900067 -0.290563 -0.535291 -0.541029 -0.127725 -0.242257 -0.180153 -0.481330 0.406184 -0.368432 -0.343466 -0.424676 -0.467271 -0.454988 0.131834 -0.541644 -0.273564 0.161905 -0.228311 -0.408473 -0.603728 -0.612341 -0.516206 0.283017 0.225466 0.205305 0.197695 0.234061 0.231903 0.170024 0.216394 0.208780 0.215591 0.220638 0.246290 0.203979 0.263157 0.210953 0.301685 0.262720 0.246355 0.230002 0.247885 0.282324 0.224726 0.229612 0.238835 0.221872 0.222185
chargesum: 0.00000
title: Mulliken charges with hydrogens summed into heavy atoms:
elementType: S O O O N N C C C C C C C C C C C C C C C C C
charge: 0.900067 -0.290563 -0.535291 -0.541029 -0.127725 -0.242257 0.102865 -0.050559 0.406184 0.063325 0.058461 0.000498 -0.031041 -0.004719 0.131834 -0.067534 -0.273564 0.161905 0.073374 -0.145753 0.120514 0.124321 0.166687
polarizability: 2.86380700e+02 -7.97188301e-01 2.36266005e+02 -1.63887988e+00 -1.14818542e+01 1.79297834e+02
1716.lowfreq: -14.7708 -7.7921 -6.5348 0.0003 0.0005 0.0016 26.5962 35.7317 47.8447
frequency: 26.3288 35.4532 47.7808 51.7302 56.5363 69.7977 82.2049 102.1756 109.1082 114.4787 135.8754 149.1057 154.4497 182.0895 186.3433 190.6284 207.3268 212.0660 233.4633 250.4124 252.0516 257.0182 289.8615 291.3912 296.6236 325.3168 356.2306 368.2567 386.4311 405.0326 422.4130 428.3858 466.1544 482.2426 513.6733 541.3438 548.1110 577.9693 607.1407 635.0622 664.8343 689.4388 771.5887 780.8644 782.1246 801.6957 811.9520 833.1262 838.9998 856.3325 873.2401 886.2006 897.7566 898.8719 908.4404 931.9382 953.9877 963.1588 975.8814 980.0130 989.0322 1035.4332 1054.3483 1065.6971 1070.2052 1091.1301 1096.7877 1108.3922 1111.4877 1115.6576 1128.4996 1131.7379 1132.7046 1150.6660 1154.0614 1169.5274 1175.2046 1186.9514 1188.7429 1197.9716 1207.1942 1212.7481 1225.1581 1240.9142 1261.2866 1281.2485 1289.7059 1307.9953 1324.2000 1326.0007 1330.4045 1341.9306 1347.6692 1365.0174 1370.3072 1396.9844 1406.8094 1411.7582 1417.9531 1436.5028 1444.0106 1454.0709 1458.7551 1460.8018 1461.5606 1463.3270 1470.2311 1471.9486 1475.4651 1479.0502 1480.5805 1484.6854 1501.9586 1564.6460 1586.3921 2836.6698 2885.1915 2940.4359 2954.4624 2955.0585 2962.3190 2971.9224 2979.8426 2985.3629 3008.3147 3016.9449 3022.3178 3038.7679 3039.0480 3040.1709 3043.7313 3048.3109 3049.3918 3051.2647 3063.9809 3092.2309 3093.1132 3110.3140 3118.7866 3152.4064 3172.8243
redmass: 3.4782 3.8637 3.2304 2.2744 2.5283 3.3919 3.5439 3.2696 3.2762 3.2564 2.1099 1.4900 2.5748 1.1554 2.0106 3.1338 3.4829 2.9019 4.3686 3.1045 2.9805 4.0488 3.4111 4.3935 5.2024 2.8515 3.9227 4.1564 4.3871 3.0746 4.8873 3.5023 3.6420 5.6081 5.0709 3.9939 3.9866 4.4839 2.2507 4.3209 4.5157 3.6826 2.8067 2.5882 5.7140 4.2734 1.9279 4.6620 1.6724 2.3705 2.0256 1.5914 2.3906 2.6292 11.6248 3.1929 1.6673 1.5235 1.9365 2.4273 1.5620 2.6538 2.5864 1.2508 2.0383 2.6799 1.6234 1.5162 1.2754 1.7792 2.2591 3.4869 1.6865 1.6268 1.4900 1.6939 1.5578 1.5212 1.4603 1.3291 1.6681 1.8758 3.6593 1.2631 1.2410 1.2266 1.3110 1.2717 1.4821 1.3867 1.5117 1.4460 1.5133 2.1749 2.1290 1.1274 4.6927 1.1465 1.8941 1.0473 1.4198 1.0512 1.0829 1.0717 1.0540 1.0751 1.0717 1.0944 1.0642 1.0799 1.0786 1.0841 1.0899 6.7276 8.5096 1.0710 1.0711 1.0410 1.0362 1.0647 1.0333 1.0790 1.0674 1.0605 1.0606 1.0868 1.0660 1.0939 1.0866 1.0929 1.0983 1.0973 1.1039 1.1026 1.1041 1.0995 1.1050 1.0965 1.1007 1.0885 1.0967
irintensity: 0.6093 1.2940 0.2000 0.6459 1.1437 3.7725 0.6818 1.1560 1.2172 0.5710 2.2675 2.4139 1.1220 0.3702 2.0108 4.6232 8.5995 0.7241 3.1927 12.1774 2.1901 4.6537 1.1826 2.8465 5.7749 3.6620 7.7389 15.1247 5.7063 1.1452 25.7182 5.9016 4.5866 97.1462 22.9329 16.3017 1.6193 10.4608 1.2519 5.9373 4.1594 3.5256 2.1000 4.5411 59.1050 11.9854 9.0558 22.0279 24.7042 16.0581 8.9596 12.3240 39.5337 6.7783 68.9496 21.6926 2.9644 6.4983 10.4208 13.6673 2.3294 41.7629 3.6633 0.7234 12.5573 29.8543 0.7998 17.4411 4.6904 7.7013 8.9080 8.5220 22.5645 12.7526 3.1678 7.5926 1.7095 21.1539 1.4110 6.5946 9.6942 12.8166 136.3764 1.1295 4.6969 0.5479 6.5685 1.6641 25.6706 1.8710 6.7173 1.6161 3.5190 2.6672 7.2962 14.3373 5.6446 10.4689 43.1809 15.2765 29.6714 16.2799 4.3966 4.3770 2.2197 10.6879 9.9905 10.1201 28.1600 13.7420 0.2442 1.3413 3.6608 27.0534 3.6395 97.7022 110.2584 71.6809 56.4374 8.6939 83.0782 6.6247 26.2033 43.6062 34.7733 27.2407 66.0080 25.4142 22.5990 19.4682 48.1115 15.4431 45.8281 38.8529 15.6994 16.2566 57.3250 2.2870 29.4893 3.9832 7.5606
temp: 298.150 k
press: 1.00000 atm
elementType: 16 8 8 8 7 7 6 6 6 6 6 6 6 6 6 6 6 6 6 6 6 6 6 1 1 1 1 1 1 1 1 1 1 1 1 1 1 1 1 1 1 1 1 1 1 1 1 1 1
symmnumber: 1
zpe: 1064049.6 jmol-1
zpe.correction: 0.405275 hartree
zpe.thermalcorrener: 0.430055 hartree
zpe.thermalcorrenthalpy: 0.430999 hartree
zpe.thermalcorrgfe: 0.350562 hartree
zpe.sumelectzpe: -1394.649720 hartree
zpe.sumelectthermal: -1394.624941 hartree
zpe.sumelectthermalent: -1394.623996 hartree
zpe.sumelectthermalfe: -1394.704434 hartree
dipole: -1.9219 3.1865 5.3029
dipole: 6.4783
quadrupole: -133.8144 -145.4353 -149.6564
quadrupole: -1.4522 2.5045 -11.4971
quadrupole: 9.1543 -2.4666 -6.6877 -1.4522 2.5045 -11.4971
hfenergy: -1395.0549953 hartree
pointgroup: C01 [X(C17H26N2O3S1)]
dipole: 0.4298727 1.2808029 -2.1612387 debye
polarizability: 283.4046237|11.4744416|240.061629|-6.1052|7.5304308|178.4782859 unknown
InChI: InChI=1S/C17H26N2O3S/c1-18(2)23(20,21)16-10-9-15(22-3)13-7-6-8-14(17(13)16)19-11-4-5-12-19/h9-10,14H,4-8,11-12H2,1-3H3
charge 0 multiplicity 1
49 atoms
S  -1.265081 -1.757662 0.934486
O  4.424018 -0.219279 -0.553244
O  -0.977278 -3.308114 1.392201
O  -1.985963 -0.785498 2.029154
N  -1.354676 1.273472 -0.151347
N  -2.378805 -1.848187 -0.696063
C  -0.196669 1.359785 0.770873
C  0.430906 2.786683 0.868195
C  0.814585 0.263004 0.396846
C  -2.570562 2.023845 0.256718
C  -1.145056 1.497965 -1.597862
C  1.90655 2.757392 1.30462
C  -3.456541 2.067049 -1.028391
C  -2.585596 1.410907 -2.146864
C  2.175118 0.564597 0.086621
C  2.72081 1.975723 0.255866
C  0.445183 -1.104657 0.371571
C  3.05776 -0.489113 -0.287838
C  1.322326 -2.154243 0.050647
C  2.646412 -1.83554 -0.306121
C  -2.198861 -3.213575 -1.266145
C  -3.783041 -1.595174 -0.262275
C  4.707814 0.346689 -1.884817
H  -0.603408 1.089809 1.766593
H  -0.170372 3.394082 1.568722
H  0.370833 3.283715 -0.120957
H  -2.338021 3.065291 0.583272
H  -3.046879 1.505412 1.109203
H  -0.48369 0.719365 -2.017599
H  -0.698653 2.497546 -1.836257
H  2.007208 2.271429 2.295176
H  2.300114 3.786837 1.402793
H  -3.709211 3.111279 -1.285344
H  -4.407297 1.523675 -0.891722
H  -2.846119 0.346065 -2.26342
H  -2.697075 1.915496 -3.122792
H  3.787975 1.907025 0.535125
H  2.677794 2.529256 -0.706096
H  0.983155 -3.191356 0.13232
H  3.371887 -2.613855 -0.559282
H  -1.145766 -3.364217 -1.55517
H  -2.816631 -3.248562 -2.183482
H  -2.508282 -4.034315 -0.587211
H  -3.802401 -0.706267 0.387183
H  -4.250178 -2.447091 0.276731
H  -4.368699 -1.381624 -1.176156
H  5.799562 0.479996 -1.922223
H  4.207476 1.32346 -2.029674
H  4.386026 -0.352419 -2.680862
