program: Orca
programVersion: 5.0.2
elementType: Cl O O O O C C C C C C C C C C C C C C C C C C C C C C C C H H H H H H H H H H H H H H H H H H H H H H H H H H H H H H
charge: 1
multiplicity: 1
keywords: wB97X-D3 TightOpt Freq def2-TZVPP def2/J RIJCOSX TightSCF defgrid3 CHELPG
frequency: 0.00 0.00 0.00 0.00 0.00 0.00 20.81 27.73 53.50 58.43 69.99 74.14 87.82 94.86 117.12 125.56 142.08 148.63 160.22 171.49 187.03 199.04 204.71 231.64 245.17 247.68 263.80 270.12 274.14 284.21 289.01 299.21 336.43 349.20 352.30 373.42 383.30 387.67 404.11 412.25 427.07 446.44 465.37 489.47 500.16 517.99 536.21 562.26 576.48 601.06 602.48 608.97 627.11 632.95 647.42 673.15 680.99 718.92 736.89 750.29 770.21 798.78 824.45 837.17 854.24 855.97 877.78 889.44 911.16 918.44 929.37 940.29 949.50 956.79 963.35 971.48 985.02 996.87 1000.93 1019.30 1022.26 1036.98 1041.38 1046.91 1051.74 1066.25 1074.57 1077.95 1091.88 1104.90 1112.70 1115.78 1126.53 1140.58 1150.73 1163.26 1173.24 1176.54 1197.56 1203.26 1211.07 1214.16 1224.44 1233.52 1253.01 1265.73 1269.09 1286.90 1290.45 1297.85 1304.28 1320.29 1324.71 1339.52 1358.18 1363.83 1366.07 1379.11 1390.20 1394.88 1399.80 1401.77 1410.03 1413.89 1421.60 1428.68 1434.85 1441.11 1465.87 1473.72 1476.85 1482.38 1485.19 1493.92 1496.64 1499.26 1506.91 1507.41 1509.92 1517.61 1522.78 1526.46 1552.47 1598.18 1669.51 1832.26 1838.97 3017.55 3029.45 3068.24 3068.99 3071.61 3077.03 3080.81 3083.54 3085.00 3101.34 3111.34 3121.95 3130.18 3134.57 3148.65 3153.13 3153.95 3159.84 3167.66 3168.84 3171.81 3181.76 3190.65 3197.86 3201.14 3206.10 3206.59 3242.99 3268.57 3829.81
frequency: 20.81 27.73 53.50 58.43 69.99 74.14 87.82 94.86 117.12 125.56 142.08 148.63 160.22 171.49 187.03 199.04 204.71 231.64 245.17 247.68 263.80 270.12 274.14 284.21 289.01 299.21 336.43 349.20 352.30 373.42 383.30 387.67 404.11 412.25 427.07 446.44 465.37 489.47 500.16 517.99 536.21 562.26 576.48 601.06 602.48 608.97 627.11 632.95 647.42 673.15 680.99 718.92 736.89 750.29 770.21 798.78 824.45 837.17 854.24 855.97 877.78 889.44 911.16 918.44 929.37 940.29 949.50 956.79 963.35 971.48 985.02 996.87 1000.93 1019.30 1022.26 1036.98 1041.38 1046.91 1051.74 1066.25 1074.57 1077.95 1091.88 1104.90 1112.70 1115.78 1126.53 1140.58 1150.73 1163.26 1173.24 1176.54 1197.56 1203.26 1211.07 1214.16 1224.44 1233.52 1253.01 1265.73 1269.09 1286.90 1290.45 1297.85 1304.28 1320.29 1324.71 1339.52 1358.18 1363.83 1366.07 1379.11 1390.20 1394.88 1399.80 1401.77 1410.03 1413.89 1421.60 1428.68 1434.85 1441.11 1465.87 1473.72 1476.85 1482.38 1485.19 1493.92 1496.64 1499.26 1506.91 1507.41 1509.92 1517.61 1522.78 1526.46 1552.47 1598.18 1669.51 1832.26 1838.97 3017.55 3029.45 3068.24 3068.99 3071.61 3077.03 3080.81 3083.54 3085.00 3101.34 3111.34 3121.95 3130.18 3134.57 3148.65 3153.13 3153.95 3159.84 3167.66 3168.84 3171.81 3181.76 3190.65 3197.86 3201.14 3206.10 3206.59 3242.99 3268.57 3829.81
formula: C24H30ClO4
InChI: InChI=1S/C24H30ClO4/c1-12(26)24(29-13(2)27)8-6-16-14-10-20(25)19-11-21(28)15-9-18(15)23(19,4)17(14)5-7-22(16,24)3/h10-11,14-18,28H,5-9H2,1-4H3
59 atoms
Cl -3.303969 3.169641 -0.113004
O  3.624051 -0.133878 1.21572
O  -6.345375 -0.757102 0.654718
O  5.11548 -0.330744 -1.859098
O  2.608137 1.677775 2.115139
C  -2.344384 -0.822566 -0.52904
C  -0.848156 -0.644595 -0.168395
C  -2.893126 -2.038844 0.192133
C  2.058639 -0.437583 -0.700165
C  1.171314 0.786235 -0.398924
C  -0.258343 0.57592 -0.886631
C  -4.342406 -2.048263 0.653749
C  -3.164641 -2.053739 1.636726
C  0.01825 -1.894182 -0.358416
C  1.484358 -1.651698 0.029824
C  3.445198 0.094327 -0.201658
C  1.97979 1.985357 -0.884477
C  -3.095717 0.441597 -0.149579
C  3.446138 1.569887 -0.638678
C  -2.571243 -1.024839 -2.042886
C  -1.119954 1.769427 -0.691797
C  2.155403 -0.728894 -2.205716
C  -5.051437 -0.803249 0.513003
C  -2.414042 1.70328 -0.344243
C  -4.402652 0.408522 0.25709
C  4.629943 -0.689634 -0.819494
C  5.133807 -1.908604 -0.094025
C  3.286151 0.693156 2.221994
C  3.884097 0.200803 3.508128
H  -0.822201 -0.401589 0.90193
H  -2.58747 -2.978899 -0.2476
H  1.115133 0.872203 0.687467
H  -0.234492 0.398258 -1.970139
H  -4.922632 -2.957726 0.564995
H  -3.0213 -1.150116 2.213579
H  -3.032116 -2.977145 2.18141
H  -0.035512 -2.242003 -1.392259
H  -0.366008 -2.706127 0.2607
H  1.546697 -1.492192 1.108484
H  2.058549 -2.55357 -0.190509
H  1.7314 2.889466 -0.331232
H  1.80638 2.183611 -1.944858
H  4.037256 1.637695 -1.548733
H  3.930205 2.193537 0.106539
H  -3.623999 -1.221452 -2.245276
H  -2.281715 -0.150934 -2.623192
H  -1.994726 -1.878858 -2.396735
H  -0.675438 2.746877 -0.841055
H  1.176685 -0.907052 -2.647771
H  2.626238 0.080578 -2.759651
H  2.749761 -1.624304 -2.387757
H  -4.97431 1.31851 0.365903
H  5.770868 -1.59235 0.732905
H  4.323769 -2.491628 0.341261
H  5.719531 -2.510484 -0.783388
H  3.730555 -0.871079 3.619207
H  3.447882 0.740083 4.342976
H  4.95993 0.377849 3.487706
H  -6.724567 -1.611848 0.887381
totalener: -1693.59207547 hartree
nucrepener: 3184.63743345 hartree
electener: -4878.22950891 hartree
oneelecener: -8622.95063679 hartree
twoeener: 3744.72112788 hartree
kineticenergy: 1686.42724044 hartree
xcener: -141.723185400089 hartree
chargesum: 1.0000000
charge: -0.014061 -0.312076 -0.162117 -0.299147 -0.362299 0.500763 0.069494 -0.196941 0.417503 -0.153712 -0.164526 -0.075618 -0.110730 -0.343630 -0.319495 0.350228 -0.244970 -0.191102 -0.241080 -0.330119 -0.135128 -0.416898 0.227395 0.024333 -0.047124 0.188585 -0.257259 0.350980 -0.255351 0.106512 0.118420 0.138337 0.112673 0.102330 0.106578 0.117272 0.116649 0.100433 0.107080 0.090087 0.104950 0.106321 0.125856 0.108407 0.119825 0.123414 0.118556 0.141267 0.081708 0.132113 0.118926 0.139124 0.104066 0.094032 0.122375 0.100376 0.114140 0.106582 0.225695
charge: 0.462349 0.318600 0.484804 0.171782 0.130219 -0.113080 -0.030300 -0.001894 -0.121399 -0.050429 -0.054532 -0.007360 0.087968 0.003980 0.002345 -0.170868 0.003129 0.024263 0.022811 0.062436 0.086084 0.043614 -0.103445 -0.383098 0.001886 -0.251439 0.018386 -0.456116 0.025869 0.048069 0.047257 0.036952 0.049777 0.036510 0.031374 0.032314 0.022351 0.024759 0.026975 0.026472 0.022710 0.020250 0.026282 0.026401 0.026530 0.026371 0.025734 0.044072 0.006353 0.028481 0.026958 0.029006 0.032320 0.018363 0.027997 0.024130 0.028459 0.032637 -0.062433
qa: -0.0141 -0.3121 -0.1621 -0.2991 -0.3623 0.5008 0.0695 -0.1969 0.4175 -0.1537 -0.1645 -0.0756 -0.1107 -0.3436 -0.3195 0.3502 -0.2450 -0.1911 -0.2411 -0.3301 -0.1351 -0.4169 0.2274 0.0243 -0.0471 0.1886 -0.2573 0.3510 -0.2554 0.1065 0.1184 0.1383 0.1127 0.1023 0.1066 0.1173 0.1166 0.1004 0.1071 0.0901 0.1050 0.1063 0.1259 0.1084 0.1198 0.1234 0.1186 0.1413 0.0817 0.1321 0.1189 0.1391 0.1041 0.0940 0.1224 0.1004 0.1141 0.1066 0.2257
va: 1.3145 2.0754 2.3931 2.1561 2.1170 3.5336 3.6039 3.8195 3.6035 3.8801 4.0899 3.8541 3.9541 3.9840 3.9745 3.6420 3.9392 3.8900 3.9851 3.9445 3.9104 4.0127 4.0387 4.0235 3.8330 3.9361 3.9070 4.1157 3.9217 1.0094 1.0084 1.0301 0.9888 1.0186 1.0206 1.0284 0.9901 1.0174 1.0152 1.0234 1.0217 1.0040 1.0377 1.0213 1.0026 0.9988 1.0020 1.0189 0.9990 1.0050 1.0015 1.0377 1.0068 1.0102 1.0159 1.0045 1.0140 1.0032 1.0180
dispcorr: -0.039928549 hartree
energy: -1693.635741551673
dipole: 20.22918 -25.00273 -4.77355 -23.39732 20.48093 -2.91639 -2.31395 3.30554 0.99160
magnitude: 5.68114 au
magnitude: 14.44032 debye
temp: 298.15 k
press: 1.00 atm
zeropoint: 0.50415922 hartree
thermalvibcorrection: 0.02436712 hartree
thermalrotcorrection: 0.00141627 hartree
thermaltrasncorrection: 0.00141627 hartree
thermaltotal: -1693.10438267 hartree
thermalcorr: 0.02719966 hartree
nonthermalcorr: 0.50415922 hartree
totalcorr: 0.53135888 hartree
thermalcorrenthalpy: 0.00094421 hartree
totalenthalpy: -1693.10343846 hartree
totalentropycorr: -0.08061744 hartree
gibbsenthalpy: -1693.18405590 hartree
gibbsminuselec: 0.45168565 hartree
