program: Orca
programVersion: 5.0.2
elementType: Br O O O O C C C C C C C C C C C C C C C C C C C H H H H H H H H H H H H H H H H H H H H H H H H H H H H
charge: 1
multiplicity: 1
keywords: wB97X-D3 TightOpt Freq def2-TZVPP def2/J RIJCOSX TightSCF defgrid3 CHELPG
frequency: 0.00 0.00 0.00 0.00 0.00 0.00 28.89 53.89 62.21 79.01 82.47 107.63 110.42 124.65 153.38 162.28 181.07 194.71 213.38 224.53 232.87 250.53 253.91 273.15 286.86 302.85 331.23 352.61 362.89 371.55 387.35 396.95 415.38 432.56 440.00 468.24 507.51 521.38 550.52 564.69 572.58 584.83 597.51 658.84 679.35 687.63 699.51 724.94 740.54 760.04 781.67 808.29 813.25 838.04 857.65 881.24 899.12 913.26 924.11 930.47 940.14 956.58 967.95 968.57 978.31 1000.29 1017.95 1026.90 1035.73 1046.14 1068.60 1078.85 1089.14 1102.56 1119.19 1123.54 1133.19 1138.12 1159.34 1165.14 1173.69 1197.49 1209.81 1212.88 1222.61 1227.47 1235.94 1244.50 1253.58 1264.62 1277.56 1285.14 1294.12 1307.03 1312.86 1319.58 1331.37 1345.34 1350.77 1360.46 1367.39 1370.32 1385.50 1390.56 1404.41 1416.73 1420.74 1421.76 1425.79 1431.60 1436.44 1451.89 1467.47 1482.78 1486.80 1492.03 1496.83 1498.22 1500.39 1502.07 1505.48 1510.91 1511.62 1514.34 1517.71 1609.36 1671.55 1785.19 2665.90 3035.17 3045.43 3048.31 3050.23 3055.21 3058.44 3059.52 3068.37 3070.76 3074.90 3078.06 3080.21 3089.32 3103.19 3103.35 3118.38 3123.76 3124.14 3126.18 3129.91 3133.66 3134.01 3136.08 3144.26 3153.12 3166.50 3789.20
frequency: 28.89 53.89 62.21 79.01 82.47 107.63 110.42 124.65 153.38 162.28 181.07 194.71 213.38 224.53 232.87 250.53 253.91 273.15 286.86 302.85 331.23 352.61 362.89 371.55 387.35 396.95 415.38 432.56 440.00 468.24 507.51 521.38 550.52 564.69 572.58 584.83 597.51 658.84 679.35 687.63 699.51 724.94 740.54 760.04 781.67 808.29 813.25 838.04 857.65 881.24 899.12 913.26 924.11 930.47 940.14 956.58 967.95 968.57 978.31 1000.29 1017.95 1026.90 1035.73 1046.14 1068.60 1078.85 1089.14 1102.56 1119.19 1123.54 1133.19 1138.12 1159.34 1165.14 1173.69 1197.49 1209.81 1212.88 1222.61 1227.47 1235.94 1244.50 1253.58 1264.62 1277.56 1285.14 1294.12 1307.03 1312.86 1319.58 1331.37 1345.34 1350.77 1360.46 1367.39 1370.32 1385.50 1390.56 1404.41 1416.73 1420.74 1421.76 1425.79 1431.60 1436.44 1451.89 1467.47 1482.78 1486.80 1492.03 1496.83 1498.22 1500.39 1502.07 1505.48 1510.91 1511.62 1514.34 1517.71 1609.36 1671.55 1785.19 2665.90 3035.17 3045.43 3048.31 3050.23 3055.21 3058.44 3059.52 3068.37 3070.76 3074.90 3078.06 3080.21 3089.32 3103.19 3103.35 3118.38 3123.76 3124.14 3126.18 3129.91 3133.66 3134.01 3136.08 3144.26 3153.12 3166.50 3789.20
formula: C19H28BrO4
InChI: InChI=1S/C19H28BrO4/c1-17(2)8-14-13(17)4-6-18(10-20)5-3-12-11(7-15(21)22)16(23)24-19(12,14)9-18/h11-14,21,23H,3-10H2,1-2H3
52 atoms
Br 3.551179 -2.931891 0.003843
O  -1.635869 0.784342 1.625951
O  -3.613075 -0.064711 1.960813
O  -5.329368 -2.114984 -1.554406
O  -5.035303 -1.599391 0.582274
C  0.079821 2.143897 0.601861
C  -0.490013 0.756545 0.635334
C  1.238904 2.349355 -0.372682
C  0.888013 3.867944 -0.369501
C  -0.550874 3.437052 0.063159
C  -1.172446 0.231279 -0.637911
C  1.558686 -0.787211 0.213372
C  0.542744 -0.205341 1.225568
C  2.560678 1.705632 -0.021243
C  2.585569 0.219871 -0.408896
C  -0.241172 -0.534876 -1.581442
C  0.724365 -1.480042 -0.876572
C  -2.35522 -0.593355 -0.103054
C  1.006161 4.568222 -1.710092
C  1.60911 4.659217 0.71466
C  2.320569 -1.842004 1.031772
C  -2.594552 0.060539 1.229321
C  -3.548473 -0.650875 -1.059195
C  -4.697341 -1.502131 -0.585602
H  0.441925 2.345021 1.611846
H  0.932739 1.992589 -1.361479
H  -1.182863 3.27819 -0.813146
H  -1.079508 4.067057 0.776664
H  -1.590186 1.091054 -1.169526
H  0.012715 -1.055969 1.664746
H  1.048948 0.294192 2.052676
H  2.781464 1.841729 1.041352
H  3.375637 2.190543 -0.563581
H  2.493289 0.168409 -1.496279
H  3.58558 -0.160508 -0.202961
H  0.321677 0.186409 -2.172838
H  -0.841759 -1.091861 -2.304376
H  0.176082 -2.312912 -0.420777
H  1.383462 -1.931014 -1.618001
H  -2.028193 -1.614623 0.129831
H  2.05237 4.668556 -2.006169
H  0.486206 4.016895 -2.496165
H  0.57919 5.571694 -1.666068
H  2.66744 4.767885 0.472005
H  1.185319 5.66104 0.796998
H  1.541864 4.193744 1.699032
H  1.637475 -2.546978 1.50109
H  2.919142 -1.366973 1.806393
H  -3.951953 0.351822 -1.230283
H  -3.213582 -1.017609 -2.027904
H  -6.084192 -2.603904 -1.198294
H  -4.283044 -0.69966 1.511923
totalener: -3615.91558224 hartree
nucrepener: 2769.23731788 hartree
electener: -6385.15290011 hartree
twoeener: 4099.15176867 hartree
kineticenergy: 3606.79351468 hartree
xcener: -171.519394983772 hartree
chargesum: 1.0000000
charge: -0.071112 -0.170300 -0.197119 -0.205849 -0.344423 -0.011296 0.520082 -0.246065 0.376710 -0.341215 -0.197179 0.379029 -0.482954 -0.199901 -0.228142 -0.203767 -0.359094 -0.081916 -0.275096 -0.315522 -0.255256 0.391542 -0.192139 0.393473 0.085817 0.078151 0.080836 0.100986 0.116427 0.118397 0.129178 0.087945 0.098622 0.098215 0.106259 0.123009 0.099151 0.097902 0.124930 0.142242 0.098898 0.069711 0.103758 0.101150 0.107517 0.090271 0.137366 0.156385 0.129649 0.124260 0.240529 0.269948
charge: 0.315611 0.423094 0.466756 0.430822 0.209909 -0.059304 -0.116719 -0.036399 -0.138799 0.042398 -0.033588 -0.158641 0.018381 -0.010681 0.003617 0.002830 -0.015960 -0.045525 0.019052 0.027495 -0.232012 -0.294488 0.016069 -0.389217 0.043506 0.035283 0.015738 0.016304 0.045187 0.034613 0.040570 0.025067 0.033737 0.029181 0.025281 0.026336 0.029589 0.025078 0.031374 0.062191 0.022571 0.011926 0.023289 0.022836 0.024069 0.014898 0.006705 0.014317 0.056103 0.052056 -0.056762 -0.155746
qa: -0.0711 -0.1703 -0.1971 -0.2058 -0.3444 -0.0113 0.5201 -0.2461 0.3767 -0.3412 -0.1972 0.3790 -0.4830 -0.1999 -0.2281 -0.2038 -0.3591 -0.0819 -0.2751 -0.3155 -0.2553 0.3915 -0.1921 0.3935 0.0858 0.0782 0.0808 0.1010 0.1164 0.1184 0.1292 0.0879 0.0986 0.0982 0.1063 0.1230 0.0992 0.0979 0.1249 0.1422 0.0989 0.0697 0.1038 0.1011 0.1075 0.0903 0.1374 0.1564 0.1296 0.1243 0.2405 0.2699
va: 1.1729 2.3094 2.3358 2.3212 2.1586 3.8227 3.5396 4.0236 3.5597 4.1181 4.0582 3.4093 4.1246 3.9369 3.9202 3.9398 3.9334 3.9010 3.9122 3.9505 4.0286 4.1931 3.9117 4.1819 1.0419 1.0290 1.0228 1.0230 1.0255 1.0142 1.0283 1.0059 1.0132 1.0094 1.0208 1.0114 1.0181 1.0137 1.0320 1.0113 1.0056 1.0051 1.0049 1.0034 1.0063 1.0050 0.9928 0.9878 1.0034 1.0263 1.0145 1.0821
dispcorr: -0.033087164 hartree
energy: -3615.951437029453
dipole: -29.56952 25.63697 -3.93255 57.91611 -57.62139 0.29472 -7.64115 6.99850 -0.64265
magnitude: 3.99560 au
magnitude: 10.15600 debye
temp: 298.15 k
press: 1.00 atm
zeropoint: 0.45522102 hartree
thermalvibcorrection: 0.01934154 hartree
thermalrotcorrection: 0.00141627 hartree
thermaltrasncorrection: 0.00141627 hartree
thermaltotal: -3615.47404193 hartree
thermalcorr: 0.02217409 hartree
nonthermalcorr: 0.45522102 hartree
totalcorr: 0.47739510 hartree
thermalcorrenthalpy: 0.00094421 hartree
totalenthalpy: -3615.47309772 hartree
totalentropycorr: -0.07126118 hartree
gibbsenthalpy: -3615.54435890 hartree
gibbsminuselec: 0.40707813 hartree
