program: Orca
programVersion: 5.0.2
elementType: Br O O O O C C C C C C C C C C C C C C C C C C C H H H H H H H H H H H H H H H H H H H H H H H H H H H H
charge: 1
multiplicity: 1
keywords: wB97X-D3 TightOpt Freq def2-TZVPP def2/J RIJCOSX TightSCF defgrid3 CHELPG
frequency: 0.00 0.00 0.00 0.00 0.00 0.00 28.64 47.53 57.32 75.18 78.43 104.53 117.15 131.25 151.18 167.44 199.07 213.09 222.82 229.38 244.87 251.21 266.77 279.20 286.31 296.02 324.00 352.66 359.34 363.28 387.39 399.77 409.95 431.50 444.37 469.15 507.55 522.28 550.22 552.02 572.63 589.76 597.31 660.20 682.63 698.26 701.91 716.87 734.57 757.68 779.98 809.02 809.48 849.30 858.23 889.33 901.68 914.35 924.64 928.25 939.46 953.24 965.85 968.73 983.02 998.74 1017.22 1027.73 1035.31 1046.38 1063.79 1071.44 1091.27 1114.88 1115.97 1118.53 1132.44 1150.32 1153.59 1161.81 1181.20 1195.52 1206.09 1218.13 1222.14 1234.24 1234.88 1244.21 1246.70 1255.55 1276.42 1284.95 1292.20 1302.92 1312.40 1320.91 1330.86 1345.46 1354.38 1362.17 1369.10 1370.14 1384.93 1390.35 1404.18 1415.35 1417.40 1421.53 1424.35 1431.39 1436.36 1452.18 1467.60 1486.76 1487.12 1491.70 1496.16 1499.11 1499.70 1502.12 1505.88 1510.32 1511.59 1513.90 1516.22 1607.48 1674.64 1786.57 2695.85 3037.97 3046.12 3046.67 3049.52 3051.82 3059.68 3062.52 3064.04 3068.38 3073.68 3077.95 3079.58 3092.55 3106.68 3107.01 3107.76 3119.95 3123.21 3129.64 3134.06 3134.73 3135.86 3136.59 3143.69 3152.53 3171.38 3789.26
frequency: 28.64 47.53 57.32 75.18 78.43 104.53 117.15 131.25 151.18 167.44 199.07 213.09 222.82 229.38 244.87 251.21 266.77 279.20 286.31 296.02 324.00 352.66 359.34 363.28 387.39 399.77 409.95 431.50 444.37 469.15 507.55 522.28 550.22 552.02 572.63 589.76 597.31 660.20 682.63 698.26 701.91 716.87 734.57 757.68 779.98 809.02 809.48 849.30 858.23 889.33 901.68 914.35 924.64 928.25 939.46 953.24 965.85 968.73 983.02 998.74 1017.22 1027.73 1035.31 1046.38 1063.79 1071.44 1091.27 1114.88 1115.97 1118.53 1132.44 1150.32 1153.59 1161.81 1181.20 1195.52 1206.09 1218.13 1222.14 1234.24 1234.88 1244.21 1246.70 1255.55 1276.42 1284.95 1292.20 1302.92 1312.40 1320.91 1330.86 1345.46 1354.38 1362.17 1369.10 1370.14 1384.93 1390.35 1404.18 1415.35 1417.40 1421.53 1424.35 1431.39 1436.36 1452.18 1467.60 1486.76 1487.12 1491.70 1496.16 1499.11 1499.70 1502.12 1505.88 1510.32 1511.59 1513.90 1516.22 1607.48 1674.64 1786.57 2695.85 3037.97 3046.12 3046.67 3049.52 3051.82 3059.68 3062.52 3064.04 3068.38 3073.68 3077.95 3079.58 3092.55 3106.68 3107.01 3107.76 3119.95 3123.21 3129.64 3134.06 3134.73 3135.86 3136.59 3143.69 3152.53 3171.38 3789.26
formula: C19H28BrO4
InChI: InChI=1S/C19H28BrO4/c1-17(2)8-14-13(17)4-6-18(10-20)5-3-12-11(7-15(21)22)16(23)24-19(12,14)9-18/h11-14,21,23H,3-10H2,1-2H3
52 atoms
Br -3.316939 -2.630805 -0.585011
O  1.210594 0.306347 -1.680477
O  3.221345 -0.307983 -2.248013
O  5.987451 -0.828471 1.158309
O  5.181464 -1.092096 -0.890981
C  -0.535948 1.647262 -0.681781
C  0.309257 0.425769 -0.468043
C  -1.498385 1.986766 0.456749
C  -1.493703 3.456037 -0.063086
C  -0.109808 3.123081 -0.708623
C  1.322379 0.448373 0.68831
C  -1.234808 -1.176149 0.858371
C  -0.576815 -0.81835 -0.490079
C  -2.692796 1.080177 0.649781
C  -2.311527 -0.188031 1.42523
C  0.779767 -0.098733 2.011825
C  -0.079146 -1.350576 1.864852
C  2.531262 -0.319699 0.127895
C  -1.495391 4.527894 1.010713
C  -2.568076 3.739633 -1.105469
C  -1.87119 -2.563251 0.70781
C  2.359987 -0.103374 -1.350468
C  3.86961 0.115702 0.728474
C  5.062552 -0.666884 0.245527
H  -1.124551 1.452004 -1.579856
H  -0.933874 2.020732 1.394579
H  0.70182 3.352336 -0.014653
H  0.117116 3.557262 -1.680983
H  1.637064 1.48541 0.836258
H  0.031955 -1.681167 -0.779754
H  -1.324128 -0.702932 -1.273981
H  -3.144825 0.825164 -0.312085
H  -3.467242 1.590461 1.227243
H  -1.987521 0.127352 2.420518
H  -3.226433 -0.757206 1.588721
H  0.2011 0.685209 2.498572
H  1.614948 -0.301337 2.686496
H  0.542125 -2.195013 1.54592
H  -0.475456 -1.622742 2.844729
H  2.398841 -1.398059 0.280698
H  -2.459654 4.565384 1.521713
H  -0.724363 4.342992 1.761539
H  -1.313375 5.513927 0.579644
H  -3.555723 3.766843 -0.642315
H  -2.395244 4.710735 -1.571523
H  -2.597513 2.9946 -1.901702
H  -2.300912 -2.889649 1.651953
H  -1.145431 -3.304113 0.378507
H  4.070173 1.166318 0.497301
H  3.81627 0.044003 1.8134
H  6.747422 -1.290848 0.778531
H  4.084739 -0.659658 -1.822931
totalener: -3615.91723029 hartree
nucrepener: 2800.21803000 hartree
electener: -6416.13526029 hartree
twoeener: 4130.21176196 hartree
kineticenergy: 3606.79751124 hartree
xcener: -171.520562874517 hartree
chargesum: 1.0000000
charge: -0.076345 -0.168882 -0.196105 -0.207020 -0.344619 -0.007006 0.528745 -0.254121 0.377649 -0.341905 -0.209031 0.385411 -0.500718 -0.173959 -0.251391 -0.200232 -0.358000 -0.076625 -0.276616 -0.313905 -0.242298 0.389748 -0.193438 0.392800 0.087694 0.077390 0.079777 0.101003 0.115673 0.115277 0.136544 0.092028 0.095625 0.100073 0.109800 0.123795 0.099521 0.096633 0.122464 0.141555 0.098555 0.068820 0.103723 0.100708 0.106588 0.092165 0.153591 0.135444 0.130063 0.123585 0.240401 0.269365
charge: 0.313438 0.425604 0.467982 0.429721 0.208246 -0.057736 -0.117046 -0.036416 -0.138952 0.041852 -0.033292 -0.160658 0.009486 -0.009483 0.002785 0.003755 -0.006508 -0.045614 0.018576 0.027819 -0.229430 -0.294269 0.015494 -0.390426 0.044730 0.034328 0.015266 0.016317 0.045237 0.036251 0.033893 0.026541 0.033044 0.026633 0.027804 0.026069 0.029255 0.023643 0.036798 0.061476 0.022386 0.011458 0.023191 0.022859 0.023789 0.015718 0.015358 0.007145 0.056188 0.051558 -0.057067 -0.154795
qa: -0.0763 -0.1689 -0.1961 -0.2070 -0.3446 -0.0070 0.5287 -0.2541 0.3776 -0.3419 -0.2090 0.3854 -0.5007 -0.1740 -0.2514 -0.2002 -0.3580 -0.0766 -0.2766 -0.3139 -0.2423 0.3897 -0.1934 0.3928 0.0877 0.0774 0.0798 0.1010 0.1157 0.1153 0.1365 0.0920 0.0956 0.1001 0.1098 0.1238 0.0995 0.0966 0.1225 0.1416 0.0986 0.0688 0.1037 0.1007 0.1066 0.0922 0.1536 0.1354 0.1301 0.1236 0.2404 0.2694
va: 1.1730 2.3119 2.3373 2.3195 2.1578 3.8217 3.5405 4.0346 3.5604 4.1151 4.0716 3.3751 4.1367 3.8899 3.9348 3.9279 3.9315 3.8998 3.9116 3.9512 4.0139 4.1964 3.9122 4.1824 1.0429 1.0278 1.0225 1.0232 1.0260 1.0169 1.0434 1.0172 1.0153 1.0097 1.0140 1.0115 1.0186 1.0153 1.0176 1.0103 1.0057 1.0051 1.0050 1.0036 1.0061 1.0053 0.9898 0.9943 1.0033 1.0263 1.0146 1.0818
dispcorr: -0.033440710 hartree
energy: -3615.953518813355
dipole: 26.24228 -21.98527 4.25700 50.61134 -50.10225 0.50908 20.02445 -18.64742 1.37703
magnitude: 4.50305 au
magnitude: 11.44584 debye
temp: 298.15 k
press: 1.00 atm
zeropoint: 0.45540756 hartree
thermalvibcorrection: 0.01926468 hartree
thermalrotcorrection: 0.00141627 hartree
thermaltrasncorrection: 0.00141627 hartree
thermaltotal: -3615.47601403 hartree
thermalcorr: 0.02209722 hartree
nonthermalcorr: 0.45540756 hartree
totalcorr: 0.47750478 hartree
thermalcorrenthalpy: 0.00094421 hartree
totalenthalpy: -3615.47506982 hartree
totalentropycorr: -0.07095878 hartree
gibbsenthalpy: -3615.54602860 hartree
gibbsminuselec: 0.40749021 hartree
