program: Orca
programVersion: 5.0.2
elementType: O O O O O O N C C C C C C C C C C C C C C C C C C C C C C H H H H H H H H H H H H H H H H H H H H H H H H H H
charge: 1
multiplicity: 1
keywords: wB97X-D3 TightOpt Freq def2-TZVPP def2/J RIJCOSX TightSCF defgrid3 CHELPG
frequency: 0.00 0.00 0.00 0.00 0.00 0.00 19.48 28.57 36.15 38.49 43.66 61.80 72.77 78.30 85.90 93.14 108.72 129.01 130.77 146.77 154.62 164.41 164.78 175.07 182.06 210.09 216.42 228.11 232.07 253.96 255.71 262.72 280.92 295.30 303.91 344.95 353.78 382.80 390.16 408.73 415.74 425.41 437.87 452.42 464.09 489.86 507.68 515.22 527.56 563.68 587.99 592.38 606.48 640.70 666.69 669.66 695.98 721.36 737.43 756.25 778.61 780.01 788.06 808.79 829.61 839.79 878.36 889.12 914.61 918.59 943.58 969.62 976.12 983.38 994.60 1007.77 1034.52 1044.86 1053.42 1074.37 1076.34 1096.11 1114.52 1131.14 1149.76 1176.16 1177.18 1178.76 1180.36 1184.10 1189.77 1203.01 1211.77 1216.18 1220.28 1239.72 1244.89 1262.35 1275.41 1287.63 1300.30 1308.86 1329.06 1341.77 1351.40 1371.74 1385.78 1394.78 1408.46 1415.54 1436.12 1450.15 1457.40 1473.98 1477.35 1480.53 1481.75 1488.60 1489.34 1490.34 1490.91 1496.75 1497.68 1504.22 1504.84 1507.01 1507.56 1511.92 1513.22 1518.35 1546.41 1573.43 1574.49 1636.79 1675.81 1682.38 1707.24 1762.33 1772.37 3044.28 3048.47 3055.00 3064.25 3068.49 3073.44 3089.56 3117.98 3123.58 3127.68 3141.16 3144.41 3149.24 3149.94 3150.28 3164.38 3173.77 3175.11 3184.09 3184.40 3191.68 3193.32 3214.22 3222.26 3554.53 3862.00
frequency: 19.48 28.57 36.15 38.49 43.66 61.80 72.77 78.30 85.90 93.14 108.72 129.01 130.77 146.77 154.62 164.41 164.78 175.07 182.06 210.09 216.42 228.11 232.07 253.96 255.71 262.72 280.92 295.30 303.91 344.95 353.78 382.80 390.16 408.73 415.74 425.41 437.87 452.42 464.09 489.86 507.68 515.22 527.56 563.68 587.99 592.38 606.48 640.70 666.69 669.66 695.98 721.36 737.43 756.25 778.61 780.01 788.06 808.79 829.61 839.79 878.36 889.12 914.61 918.59 943.58 969.62 976.12 983.38 994.60 1007.77 1034.52 1044.86 1053.42 1074.37 1076.34 1096.11 1114.52 1131.14 1149.76 1176.16 1177.18 1178.76 1180.36 1184.10 1189.77 1203.01 1211.77 1216.18 1220.28 1239.72 1244.89 1262.35 1275.41 1287.63 1300.30 1308.86 1329.06 1341.77 1351.40 1371.74 1385.78 1394.78 1408.46 1415.54 1436.12 1450.15 1457.40 1473.98 1477.35 1480.53 1481.75 1488.60 1489.34 1490.34 1490.91 1496.75 1497.68 1504.22 1504.84 1507.01 1507.56 1511.92 1513.22 1518.35 1546.41 1573.43 1574.49 1636.79 1675.81 1682.38 1707.24 1762.33 1772.37 3044.28 3048.47 3055.00 3064.25 3068.49 3073.44 3089.56 3117.98 3123.58 3127.68 3141.16 3144.41 3149.24 3149.94 3150.28 3164.38 3173.77 3175.11 3184.09 3184.40 3191.68 3193.32 3214.22 3222.26 3554.53 3862.00
formula: C22H26NO6
InChI: InChI=1S/C22H26NO6/c1-12(24)23-16-8-6-13-10-19(27-3)21(28-4)22(29-5)20(13)14-7-9-18(26-2)17(25)11-15(14)16/h7,9-11,16,23-24H,6,8H2,1-5H3
55 atoms
O  -0.750004 -1.76288 -1.142013
O  -3.521516 -1.798205 -0.860797
O  -4.666931 -0.163506 1.18911
O  5.279895 -1.533094 0.014988
O  4.94572 0.822765 -0.95117
O  0.752925 3.064897 -2.098897
N  -0.415116 2.263138 -0.398537
C  0.747946 2.243881 0.523826
C  0.270007 2.46442 1.964283
C  -0.268635 1.209579 2.662135
C  1.582693 0.977809 0.325156
C  -1.146628 0.400938 1.74584
C  -0.5417 -0.327197 0.714025
C  0.94171 -0.299296 0.534235
C  -1.357786 -1.030032 -0.17929
C  -2.525281 0.465528 1.840466
C  2.865515 1.213302 -0.032693
C  1.602497 -1.484265 0.596239
C  -2.755034 -1.017866 -0.043287
C  -3.343962 -0.236213 0.955857
C  3.999823 0.34862 -0.359588
C  -0.38452 2.625202 -1.633745
C  2.978034 -1.821988 0.482647
C  4.042495 -1.069965 0.093223
C  -1.582471 2.548439 -2.507589
C  -1.247374 -1.732365 -2.473703
C  -3.65646 -3.141649 -0.398508
C  -5.60246 -0.206693 0.116795
C  5.569631 -2.863484 0.406258
H  1.35486 3.097561 0.234337
H  -0.488186 3.251928 1.955177
H  1.117775 2.858371 2.525087
H  0.56906 0.594452 2.993502
H  -0.818285 1.506421 3.554045
H  -1.282869 1.875853 -0.046168
H  -3.003915 1.035678 2.626581
H  3.156027 2.247593 -0.183473
H  0.972025 -2.342823 0.795262
H  3.184301 -2.859613 0.707361
H  -2.431675 2.124626 -1.977493
H  -1.356932 1.92295 -3.372865
H  -1.842426 3.546608 -2.863387
H  -1.761123 -0.790886 -2.679405
H  -1.938918 -2.551073 -2.661537
H  -0.379723 -1.829239 -3.123412
H  -4.292554 -3.654338 -1.115544
H  -2.68272 -3.634962 -0.351425
H  -4.122857 -3.164433 0.589052
H  -6.487683 0.30913 0.480241
H  -5.213528 0.307144 -0.763627
H  -5.858918 -1.229058 -0.152506
H  5.293736 -3.034644 1.449074
H  5.055494 -3.580463 -0.237406
H  6.642739 -2.976077 0.289632
H  0.70376 3.317164 -3.025768
totalener: -1359.90617015 hartree
nucrepener: 2969.38962931 hartree
electener: -4329.29579946 hartree
oneelecener: -7734.47965934 hartree
twoeener: 3405.18385988 hartree
kineticenergy: 1353.14826550 hartree
xcener: -129.341730996797 hartree
chargesum: 1.0000000
charge: -0.304876 -0.360225 -0.284616 -0.204501 -0.305276 -0.188072 -0.159242 0.357062 -0.238480 -0.120441 -0.144794 -0.096715 -0.073806 0.010842 0.025851 -0.164299 -0.101389 -0.072769 0.183230 0.170984 0.200686 0.398253 -0.209896 0.222304 -0.222850 -0.097694 -0.134663 -0.093373 -0.143642 0.122311 0.106666 0.110348 0.123778 0.100737 0.200443 0.124399 0.099615 0.113147 0.109812 0.093572 0.122809 0.153281 0.067081 0.116221 0.125372 0.135312 0.113587 0.118035 0.129667 0.083976 0.103802 0.111024 0.109177 0.135814 0.222420
charge: 0.292924 0.258886 0.295293 0.348494 0.147407 0.467800 0.434177 -0.052350 0.007467 0.007797 -0.050782 -0.080094 -0.075672 -0.069489 -0.212963 -0.012099 0.019996 0.031546 -0.237946 -0.222584 -0.295732 -0.208998 -0.027393 -0.187778 0.054678 -0.045527 -0.047254 -0.037804 -0.030670 0.041643 0.029683 0.039959 0.039005 0.035858 0.018269 0.032739 0.036504 0.045468 0.027091 0.038891 0.044422 0.047402 -0.000320 0.007855 0.010525 0.014739 0.008742 0.010853 0.012991 0.002193 0.004641 0.009367 0.008687 0.020311 -0.058846
qa: -0.3049 -0.3602 -0.2846 -0.2045 -0.3053 -0.1881 -0.1592 0.3571 -0.2385 -0.1204 -0.1448 -0.0967 -0.0738 0.0108 0.0259 -0.1643 -0.1014 -0.0728 0.1832 0.1710 0.2007 0.3983 -0.2099 0.2223 -0.2228 -0.0977 -0.1347 -0.0934 -0.1436 0.1223 0.1067 0.1103 0.1238 0.1007 0.2004 0.1244 0.0996 0.1131 0.1098 0.0936 0.1228 0.1533 0.0671 0.1162 0.1254 0.1353 0.1136 0.1180 0.1297 0.0840 0.1038 0.1110 0.1092 0.1358 0.2224
va: 2.0548 1.9487 2.0949 2.2306 2.1802 2.3473 3.5110 3.4304 3.9173 3.8776 3.6988 3.7315 3.4510 3.5836 3.9570 3.9452 3.8120 4.0122 3.6689 4.0534 4.2303 3.9117 3.8800 3.7418 3.9266 3.8928 3.8333 3.8750 3.8797 1.0079 1.0137 1.0156 1.0023 1.0164 1.0197 1.0258 1.0346 1.0155 1.0232 1.0178 0.9983 0.9991 0.9900 0.9905 0.9897 0.9891 0.9896 0.9897 0.9932 0.9935 0.9863 0.9863 0.9862 0.9967 1.0239
dispcorr: -0.032675599 hartree
energy: -1359.943221328573
dipole: -15.69847 13.46479 -2.23368 -3.26854 5.00838 1.73983 -3.68602 2.02112 -1.66490
magnitude: 3.28455 au
magnitude: 8.34866 debye
temp: 298.15 k
press: 1.00 atm
zeropoint: 0.45817648 hartree
thermalvibcorrection: 0.02584057 hartree
thermalrotcorrection: 0.00141627 hartree
thermaltrasncorrection: 0.00141627 hartree
thermaltotal: -1359.45637174 hartree
thermalcorr: 0.02867311 hartree
nonthermalcorr: 0.45817648 hartree
totalcorr: 0.48684959 hartree
thermalcorrenthalpy: 0.00094421 hartree
totalenthalpy: -1359.45542753 hartree
totalentropycorr: -0.08436118 hartree
gibbsenthalpy: -1359.53978871 hartree
gibbsminuselec: 0.40343262 hartree
