program: Orca
programVersion: 5.0.2
elementType: O O O O O O N C C C C C C C C C C C C C C C C C C C C C C H H H H H H H H H H H H H H H H H H H H H H H H H H
charge: 1
multiplicity: 1
keywords: wB97X-D3 TightOpt Freq def2-TZVPP def2/J RIJCOSX TightSCF defgrid3 CHELPG
frequency: 0.00 0.00 0.00 0.00 0.00 0.00 25.75 28.41 37.89 40.92 46.36 63.07 69.37 81.28 86.08 90.85 93.62 116.66 131.04 148.44 159.08 162.51 164.97 172.24 186.14 192.93 210.32 215.53 228.42 237.53 260.25 275.61 282.78 296.75 306.51 344.43 355.75 367.36 381.83 408.62 414.34 417.47 435.99 450.24 463.03 480.88 505.23 514.63 531.97 562.19 587.60 592.69 606.60 640.62 642.81 670.32 695.20 717.90 733.44 754.15 776.80 782.75 791.50 810.92 830.26 839.34 879.64 904.00 912.51 915.18 934.48 968.90 976.04 983.18 1004.05 1008.52 1028.22 1044.58 1053.65 1073.20 1076.28 1096.14 1115.38 1124.38 1149.49 1158.89 1175.80 1176.95 1178.13 1183.83 1187.12 1203.34 1214.91 1217.06 1220.43 1238.79 1244.77 1261.00 1275.46 1285.23 1290.34 1308.46 1330.75 1341.84 1347.69 1369.23 1384.41 1394.71 1406.17 1415.70 1431.18 1439.64 1454.45 1474.26 1477.31 1480.49 1481.49 1488.93 1489.46 1490.66 1493.59 1497.04 1497.72 1500.90 1504.62 1505.32 1507.78 1511.96 1513.21 1518.70 1545.79 1557.95 1573.94 1636.57 1669.54 1676.03 1697.25 1739.80 1771.42 3044.40 3055.79 3063.54 3068.11 3073.28 3080.75 3089.36 3118.29 3127.11 3142.32 3144.26 3146.56 3149.68 3149.86 3165.44 3172.20 3173.95 3174.83 3182.84 3184.72 3189.90 3200.30 3204.74 3214.37 3555.12 3861.76
frequency: 25.75 28.41 37.89 40.92 46.36 63.07 69.37 81.28 86.08 90.85 93.62 116.66 131.04 148.44 159.08 162.51 164.97 172.24 186.14 192.93 210.32 215.53 228.42 237.53 260.25 275.61 282.78 296.75 306.51 344.43 355.75 367.36 381.83 408.62 414.34 417.47 435.99 450.24 463.03 480.88 505.23 514.63 531.97 562.19 587.60 592.69 606.60 640.62 642.81 670.32 695.20 717.90 733.44 754.15 776.80 782.75 791.50 810.92 830.26 839.34 879.64 904.00 912.51 915.18 934.48 968.90 976.04 983.18 1004.05 1008.52 1028.22 1044.58 1053.65 1073.20 1076.28 1096.14 1115.38 1124.38 1149.49 1158.89 1175.80 1176.95 1178.13 1183.83 1187.12 1203.34 1214.91 1217.06 1220.43 1238.79 1244.77 1261.00 1275.46 1285.23 1290.34 1308.46 1330.75 1341.84 1347.69 1369.23 1384.41 1394.71 1406.17 1415.70 1431.18 1439.64 1454.45 1474.26 1477.31 1480.49 1481.49 1488.93 1489.46 1490.66 1493.59 1497.04 1497.72 1500.90 1504.62 1505.32 1507.78 1511.96 1513.21 1518.70 1545.79 1557.95 1573.94 1636.57 1669.54 1676.03 1697.25 1739.80 1771.42 3044.40 3055.79 3063.54 3068.11 3073.28 3080.75 3089.36 3118.29 3127.11 3142.32 3144.26 3146.56 3149.68 3149.86 3165.44 3172.20 3173.95 3174.83 3182.84 3184.72 3189.90 3200.30 3204.74 3214.37 3555.12 3861.76
formula: C22H26NO6
InChI: InChI=1S/C22H26NO6/c1-12(24)23-16-8-6-13-10-19(27-3)21(28-4)22(29-5)20(13)14-7-9-18(26-2)17(25)11-15(14)16/h7,9-11,16,23-24H,6,8H2,1-5H3
55 atoms
O  0.850908 -1.788945 1.121026
O  3.630748 -1.683531 0.884475
O  4.722382 0.004404 -1.144169
O  -5.093932 -2.008547 -0.291165
O  -4.799857 0.386596 1.131134
O  -0.942057 2.899548 2.042273
N  0.313054 2.213723 0.354258
C  -0.829633 2.125663 -0.589721
C  -0.337681 2.365193 -2.022014
C  0.283339 1.13913 -2.702221
C  -1.591471 0.814113 -0.393762
C  1.187279 0.383547 -1.765919
C  0.60487 -0.371803 -0.741281
C  -0.88023 -0.421153 -0.585123
C  1.440368 -1.029972 0.168538
C  2.562259 0.520565 -1.837901
C  -2.887714 0.970927 -0.028377
C  -1.48173 -1.641988 -0.659619
C  2.836848 -0.944717 0.054942
C  3.400128 -0.134594 -0.936345
C  -3.927982 0.024061 0.361056
C  0.232182 2.546176 1.595656
C  -2.839729 -2.027228 -0.600735
C  -3.953246 -1.331712 -0.231706
C  1.412675 2.528484 2.495752
C  1.337169 -1.760148 2.456997
C  3.87513 -3.005413 0.40434
C  5.631531 0.037399 -0.048913
C  -6.371848 -1.362658 -0.287016
H  -1.489287 2.945159 -0.316377
H  0.374833 3.194177 -2.003332
H  -1.194785 2.708684 -2.601532
H  -0.512304 0.476941 -3.046374
H  0.832778 1.462277 -3.585079
H  1.211365 1.890057 0.014704
H  3.023735 1.112262 -2.618311
H  -3.238344 1.984275 0.136789
H  -0.808862 -2.469438 -0.850892
H  -3.038579 -3.06076 -0.860274
H  2.29945 2.172112 1.977748
H  1.208649 1.870184 3.341871
H  1.598636 3.533092 2.878704
H  1.813677 -0.803528 2.681297
H  2.056904 -2.555518 2.638192
H  0.468209 -1.900043 3.096989
H  4.519034 -3.487228 1.135665
H  2.940112 -3.563163 0.312837
H  4.376909 -2.976919 -0.565554
H  6.492751 0.600412 -0.39983
H  5.189351 0.541774 0.811751
H  5.942885 -0.962324 0.246252
H  -6.656767 -1.06997 0.718644
H  -6.368034 -0.488535 -0.937615
H  -7.057401 -2.106591 -0.682376
H  -0.932056 3.129337 2.976236
totalener: -1359.90428581 hartree
nucrepener: 2971.89735597 hartree
electener: -4331.80164177 hartree
oneelecener: -7739.63189623 hartree
twoeener: 3407.83025446 hartree
kineticenergy: 1353.15071444 hartree
xcener: -129.342713019124 hartree
chargesum: 1.0000000
charge: -0.301210 -0.360806 -0.286418 -0.250594 -0.354474 -0.188464 -0.158778 0.362895 -0.243083 -0.114671 -0.140577 -0.102464 -0.054280 0.026745 0.021554 -0.171010 -0.106116 -0.056010 0.183815 0.171384 0.185858 0.398308 -0.197615 0.222971 -0.221282 -0.098873 -0.133903 -0.092097 -0.129922 0.123258 0.107247 0.109253 0.123909 0.100723 0.200985 0.124580 0.098663 0.116078 0.127773 0.093424 0.122669 0.153311 0.067663 0.116425 0.126113 0.135309 0.114238 0.117964 0.129845 0.082931 0.103672 0.133412 0.112007 0.125057 0.222610
charge: 0.294755 0.258788 0.294718 0.323454 0.130298 0.468506 0.433999 -0.052240 0.007007 0.007840 -0.051134 -0.080120 -0.075254 -0.066837 -0.212340 -0.012541 0.020187 0.031509 -0.238043 -0.222965 -0.305556 -0.208729 0.001280 -0.188095 0.055066 -0.044920 -0.046672 -0.037802 -0.018725 0.041649 0.029859 0.039557 0.039147 0.035949 0.018727 0.032632 0.035416 0.046465 0.041439 0.039006 0.044662 0.047392 -0.000383 0.008045 0.010793 0.014794 0.009229 0.010974 0.012964 0.002032 0.004628 0.007637 0.008029 0.012532 -0.058609
qa: -0.3012 -0.3608 -0.2864 -0.2506 -0.3545 -0.1885 -0.1588 0.3629 -0.2431 -0.1147 -0.1406 -0.1025 -0.0543 0.0267 0.0216 -0.1710 -0.1061 -0.0560 0.1838 0.1714 0.1859 0.3983 -0.1976 0.2230 -0.2213 -0.0989 -0.1339 -0.0921 -0.1299 0.1233 0.1072 0.1093 0.1239 0.1007 0.2010 0.1246 0.0987 0.1161 0.1278 0.0934 0.1227 0.1533 0.0677 0.1164 0.1261 0.1353 0.1142 0.1180 0.1298 0.0829 0.1037 0.1334 0.1120 0.1251 0.2226
va: 2.0588 1.9475 2.0917 2.1515 2.1194 2.3477 3.5106 3.4273 3.9158 3.8757 3.6932 3.7447 3.4251 3.5500 3.9743 3.9527 3.8143 3.9214 3.6723 4.0474 4.1262 3.9119 3.9429 3.8446 3.9261 3.8921 3.8328 3.8751 3.8531 1.0056 1.0136 1.0156 1.0023 1.0165 1.0186 1.0258 1.0324 1.0131 1.0184 1.0181 0.9986 0.9991 0.9901 0.9907 0.9895 0.9890 0.9895 0.9896 0.9933 0.9937 0.9863 0.9967 0.9886 0.9911 1.0235
dispcorr: -0.033043713 hartree
energy: -1359.941668603427
dipole: 12.96570 -11.28016 1.68554 2.55782 0.14728 2.70510 4.36445 -2.67231 1.69214
magnitude: 3.60860 au
magnitude: 9.17232 debye
temp: 298.15 k
press: 1.00 atm
zeropoint: 0.45776925 hartree
thermalvibcorrection: 0.02596771 hartree
thermalrotcorrection: 0.00141627 hartree
thermaltrasncorrection: 0.00141627 hartree
thermaltotal: -1359.45509911 hartree
thermalcorr: 0.02880025 hartree
nonthermalcorr: 0.45776925 hartree
totalcorr: 0.48656950 hartree
thermalcorrenthalpy: 0.00094421 hartree
totalenthalpy: -1359.45415490 hartree
totalentropycorr: -0.08449558 hartree
gibbsenthalpy: -1359.53865048 hartree
gibbsminuselec: 0.40301812 hartree
