program: Orca
programVersion: 5.0.2
elementType: Cl N N C C C C C C C C C C C C C C C C C C C H H H H H H H H H H H H H H H H H H H H H H H H
charge: 1
multiplicity: 1
keywords: wB97X-D3 TightOpt Freq def2-TZVPP def2/J RIJCOSX TightSCF defgrid3 CHELPG
frequency: 0.00 0.00 0.00 0.00 0.00 0.00 27.26 42.10 53.89 64.75 75.48 88.69 115.13 145.32 159.27 192.88 208.26 217.05 234.70 248.37 277.52 295.23 328.06 341.95 360.86 376.41 392.14 412.89 416.99 445.79 462.70 485.59 490.69 508.38 541.11 568.98 603.09 618.31 632.54 649.32 687.38 710.22 753.17 773.95 785.12 791.56 800.21 835.44 847.72 856.60 875.92 880.05 907.12 931.82 967.03 974.68 986.59 988.67 999.78 1009.60 1036.00 1040.49 1071.38 1072.62 1075.51 1089.70 1108.26 1116.17 1148.38 1173.52 1176.47 1185.77 1193.04 1200.92 1208.27 1223.64 1232.55 1246.22 1257.28 1268.42 1278.42 1300.60 1306.85 1317.90 1336.42 1340.44 1350.10 1376.34 1382.53 1391.45 1395.76 1414.98 1435.73 1450.59 1459.19 1470.94 1477.65 1485.81 1488.41 1497.01 1497.53 1499.29 1502.96 1511.00 1512.07 1515.49 1521.18 1541.15 1549.34 1559.13 1635.97 1667.79 1670.14 1688.55 3062.42 3073.86 3083.01 3089.16 3094.86 3105.73 3108.51 3119.60 3123.93 3137.75 3171.15 3181.03 3187.71 3191.84 3194.23 3200.42 3201.22 3202.19 3212.65 3228.60 3235.03 3237.02 3244.38 3273.24
frequency: 27.26 42.10 53.89 64.75 75.48 88.69 115.13 145.32 159.27 192.88 208.26 217.05 234.70 248.37 277.52 295.23 328.06 341.95 360.86 376.41 392.14 412.89 416.99 445.79 462.70 485.59 490.69 508.38 541.11 568.98 603.09 618.31 632.54 649.32 687.38 710.22 753.17 773.95 785.12 791.56 800.21 835.44 847.72 856.60 875.92 880.05 907.12 931.82 967.03 974.68 986.59 988.67 999.78 1009.60 1036.00 1040.49 1071.38 1072.62 1075.51 1089.70 1108.26 1116.17 1148.38 1173.52 1176.47 1185.77 1193.04 1200.92 1208.27 1223.64 1232.55 1246.22 1257.28 1268.42 1278.42 1300.60 1306.85 1317.90 1336.42 1340.44 1350.10 1376.34 1382.53 1391.45 1395.76 1414.98 1435.73 1450.59 1459.19 1470.94 1477.65 1485.81 1488.41 1497.01 1497.53 1499.29 1502.96 1511.00 1512.07 1515.49 1521.18 1541.15 1549.34 1559.13 1635.97 1667.79 1670.14 1688.55 3062.42 3073.86 3083.01 3089.16 3094.86 3105.73 3108.51 3119.60 3123.93 3137.75 3171.15 3181.03 3187.71 3191.84 3194.23 3200.42 3201.22 3202.19 3212.65 3228.60 3235.03 3237.02 3244.38 3273.24
formula: C19H24ClN2
InChI: InChI=1S/C19H24ClN2/c1-21(2)12-5-13-22-18-7-4-3-6-15(18)8-9-16-10-11-17(20)14-19(16)22/h3-4,6-7,10-11,14,21H,5,8-9,12-13H2,1-2H3
46 atoms
Cl 4.220614 0.73824 -1.083158
N  -0.765219 -0.126002 -0.858669
N  1.429598 -1.757153 1.034577
C  -0.401204 -1.195664 -1.781089
C  0.251345 0.749304 -0.448488
C  -2.12916 -0.1557 -0.415873
C  -1.202708 2.444733 0.871842
C  -2.260947 2.354706 -0.225599
C  0.110955 1.842724 0.444002
C  -2.884296 0.997763 -0.187515
C  0.377385 -2.410573 -1.187568
C  0.379043 -2.569781 0.330064
C  1.555725 0.490614 -0.924132
C  -2.762531 -1.396532 -0.283193
C  1.25773 2.49798 0.876588
C  -4.219508 0.87163 0.180534
C  2.666989 1.183395 -0.466238
C  -4.095275 -1.500814 0.072708
C  2.544224 2.180877 0.472699
C  -4.836905 -0.358362 0.309234
C  2.781845 -2.362157 0.945061
C  1.046475 -1.469288 2.438651
H  -1.324955 -1.552221 -2.222302
H  0.16713 -0.779459 -2.611637
H  -1.588938 1.969112 1.776986
H  -1.015558 3.487037 1.129014
H  -3.029602 3.109254 -0.067485
H  -1.806395 2.560196 -1.197909
H  1.404214 -2.424238 -1.558162
H  -0.072873 -3.318845 -1.589618
H  0.561352 -3.607379 0.608896
H  -0.574215 -2.268389 0.757687
H  1.736726 -0.253236 -1.68109
H  -2.230663 -2.315159 -0.48456
H  1.127262 3.328125 1.560303
H  -4.787956 1.776474 0.35806
H  -4.547514 -2.480062 0.157431
H  3.404447 2.720436 0.840866
H  -5.880977 -0.422095 0.583772
H  3.027345 -2.546451 -0.096996
H  2.789249 -3.296284 1.502607
H  3.505906 -1.667554 1.36337
H  1.830249 -0.877635 2.904722
H  0.917936 -2.407793 2.974034
H  0.114699 -0.908564 2.435464
H  1.482295 -0.851002 0.542939
totalener: -1308.01931674 hartree
nucrepener: 2033.25316857 hartree
electener: -3341.27248531 hartree
oneelecener: -5802.62330803 hartree
twoeener: 2461.35082273 hartree
kineticenergy: 1302.60713947 hartree
xcener: -106.993060125603 hartree
chargesum: 1.0000000
charge: -0.039041 0.012268 0.132035 -0.122437 0.026084 0.184074 -0.114387 -0.123749 -0.110853 -0.117359 -0.213322 -0.183839 -0.203965 -0.269375 -0.067946 -0.064670 0.054041 -0.150928 -0.187116 -0.127000 -0.185102 -0.170565 0.140166 0.133833 0.099223 0.096182 0.090760 0.112295 0.106417 0.133918 0.137240 0.155227 0.128080 0.129785 0.126146 0.121720 0.138461 0.144126 0.144271 0.137750 0.129094 0.139441 0.135138 0.139492 0.130719 0.093668
charge: 0.430369 0.274587 0.437727 -0.035744 -0.123180 -0.117769 -0.001163 0.004422 -0.067638 -0.065535 -0.017668 0.008877 -0.061221 -0.032066 0.016032 0.013216 -0.415166 -0.007778 -0.045803 -0.002160 0.062622 0.065619 0.033416 0.026689 0.031607 0.034648 0.034722 0.036746 0.021026 0.040183 0.036119 0.030530 0.010589 0.017401 0.036964 0.030616 0.027316 0.029600 0.028245 0.025275 0.029012 0.029752 0.029843 0.030550 0.028501 0.000069
qa: -0.0390 0.0123 0.1320 -0.1224 0.0261 0.1841 -0.1144 -0.1237 -0.1109 -0.1174 -0.2133 -0.1838 -0.2040 -0.2694 -0.0679 -0.0647 0.0540 -0.1509 -0.1871 -0.1270 -0.1851 -0.1706 0.1402 0.1338 0.0992 0.0962 0.0908 0.1123 0.1064 0.1339 0.1372 0.1552 0.1281 0.1298 0.1261 0.1217 0.1385 0.1441 0.1443 0.1377 0.1291 0.1394 0.1351 0.1395 0.1307 0.0937
va: 1.2742 3.1605 3.5763 3.7979 3.8160 3.6701 3.8753 3.8468 3.7432 3.9038 3.7559 3.8677 3.7593 3.9095 3.9244 3.9211 4.0002 4.0528 4.0010 4.0171 3.8685 3.8452 0.9986 1.0008 1.0064 1.0102 1.0167 1.0093 1.0157 1.0103 1.0101 0.9854 1.0480 1.0075 1.0029 1.0085 1.0015 1.0067 0.9975 1.0002 1.0024 0.9968 0.9986 0.9985 0.9985 1.1670
dispcorr: -0.028709544 hartree
energy: -1308.050749155094
dipole: -10.96951 11.71558 0.74607 -14.09545 11.75033 -2.34512 9.99476 -8.43976 1.55499
magnitude: 2.91105 au
magnitude: 7.39930 debye
temp: 298.15 k
press: 1.00 atm
zeropoint: 0.40404948 hartree
thermalvibcorrection: 0.01685017 hartree
thermalrotcorrection: 0.00141627 hartree
thermaltrasncorrection: 0.00141627 hartree
thermaltotal: -1307.62701696 hartree
thermalcorr: 0.01968271 hartree
nonthermalcorr: 0.40404948 hartree
totalcorr: 0.42373220 hartree
thermalcorrenthalpy: 0.00094421 hartree
totalenthalpy: -1307.62607275 hartree
totalentropycorr: -0.06595294 hartree
gibbsenthalpy: -1307.69202569 hartree
gibbsminuselec: 0.35872347 hartree
