program: Orca
programVersion: 5.0.2
elementType: Cl Cl N N N N C C C C C C C C C C C C C C C C C C C C C C C C C C C H H H H H H H H H H H H H H H H H H H H H H H
charge: 1
multiplicity: 1
keywords: wB97X-D3 TightOpt Freq def2-TZVPP def2/J RIJCOSX TightSCF defgrid3 CHELPG
frequency: 0.00 0.00 0.00 0.00 0.00 0.00 6.04 11.63 26.80 29.88 35.14 42.87 46.53 61.18 66.02 93.09 112.23 121.25 135.46 152.18 163.12 164.89 207.08 209.35 224.43 251.40 264.63 279.99 289.48 304.87 313.65 327.75 354.51 378.91 395.23 410.60 426.93 429.25 430.94 445.17 460.83 465.56 477.41 489.12 512.36 517.36 535.17 569.47 574.30 594.06 609.53 626.01 645.66 654.94 655.97 671.37 692.37 721.14 740.07 741.89 745.11 755.78 761.39 766.21 785.60 792.10 813.27 826.28 835.53 854.42 858.25 865.77 867.15 870.93 884.44 887.27 893.38 905.89 942.30 958.26 971.32 982.86 987.73 999.23 1004.98 1010.67 1018.58 1021.33 1035.69 1045.69 1046.95 1083.88 1135.85 1138.47 1140.16 1141.00 1154.05 1158.75 1169.17 1192.81 1200.04 1203.91 1204.33 1220.92 1230.93 1264.63 1269.53 1286.06 1303.26 1303.60 1310.32 1324.64 1331.52 1333.76 1344.15 1355.02 1367.26 1389.58 1399.19 1410.15 1413.16 1432.12 1455.48 1457.92 1466.48 1488.11 1490.51 1502.27 1513.54 1515.49 1532.80 1547.05 1552.05 1561.85 1588.15 1625.13 1654.47 1657.21 1662.74 1669.41 1681.55 1684.55 1697.95 1701.68 1731.52 3032.53 3061.61 3065.88 3139.20 3146.73 3150.20 3153.51 3201.50 3212.37 3214.68 3215.51 3216.30 3221.90 3222.74 3235.57 3236.47 3237.45 3237.49 3237.86 3245.17 3267.13 3484.92 3631.92
frequency: 6.04 11.63 26.80 29.88 35.14 42.87 46.53 61.18 66.02 93.09 112.23 121.25 135.46 152.18 163.12 164.89 207.08 209.35 224.43 251.40 264.63 279.99 289.48 304.87 313.65 327.75 354.51 378.91 395.23 410.60 426.93 429.25 430.94 445.17 460.83 465.56 477.41 489.12 512.36 517.36 535.17 569.47 574.30 594.06 609.53 626.01 645.66 654.94 655.97 671.37 692.37 721.14 740.07 741.89 745.11 755.78 761.39 766.21 785.60 792.10 813.27 826.28 835.53 854.42 858.25 865.77 867.15 870.93 884.44 887.27 893.38 905.89 942.30 958.26 971.32 982.86 987.73 999.23 1004.98 1010.67 1018.58 1021.33 1035.69 1045.69 1046.95 1083.88 1135.85 1138.47 1140.16 1141.00 1154.05 1158.75 1169.17 1192.81 1200.04 1203.91 1204.33 1220.92 1230.93 1264.63 1269.53 1286.06 1303.26 1303.60 1310.32 1324.64 1331.52 1333.76 1344.15 1355.02 1367.26 1389.58 1399.19 1410.15 1413.16 1432.12 1455.48 1457.92 1466.48 1488.11 1490.51 1502.27 1513.54 1515.49 1532.80 1547.05 1552.05 1561.85 1588.15 1625.13 1654.47 1657.21 1662.74 1669.41 1681.55 1684.55 1697.95 1701.68 1731.52 3032.53 3061.61 3065.88 3139.20 3146.73 3150.20 3153.51 3201.50 3212.37 3214.68 3215.51 3216.30 3221.90 3222.74 3235.57 3236.47 3237.45 3237.49 3237.86 3245.17 3267.13 3484.92 3631.92
formula: C27H23Cl2N4
InChI: InChI=1S/C27H23Cl2N4/c1-17(2)30-24-16-27-25(15-23(24)31-20-11-7-18(28)8-12-20)32-22-5-3-4-6-26(22)33(27)21-13-9-19(29)10-14-21/h3-17,31-32H,1-2H3
56 atoms
Cl 7.012161 -2.083815 0.113578
Cl -8.296011 1.027168 -0.005795
N  2.062822 1.144654 -0.01521
N  -0.236548 2.601917 -0.112504
N  -2.886162 -1.337044 0.03543
N  -0.743531 -2.798926 0.10731
C  0.861796 0.472544 0.009922
C  -0.368815 1.281817 -0.043767
C  2.15259 2.538697 -0.085908
C  0.761171 -0.873905 0.070584
C  -0.517545 -1.547907 0.07688
C  0.979885 3.286737 -0.136216
C  -1.743546 -0.686717 0.030004
C  -1.62164 0.694722 -0.028171
C  3.270695 0.369239 0.017238
C  3.372921 3.210233 -0.109503
C  0.327565 -3.78095 0.136838
C  1.010566 4.672132 -0.208408
C  3.848931 0.050501 1.235307
C  3.836837 -0.063283 -1.171387
C  3.402041 4.589696 -0.181409
C  2.224559 5.32679 -0.231133
C  -4.188129 -0.758677 0.027578
C  -0.169511 -5.023373 0.860417
C  0.748371 -4.090866 -1.29937
C  5.007434 -0.706997 1.267939
C  4.994827 -0.821299 -1.144539
C  5.572387 -1.139574 0.076601
C  -4.624141 -0.013117 1.113714
C  -5.020204 -0.968636 -1.06145
C  -5.891467 0.542078 1.103645
C  -6.292019 -0.422288 -1.071462
C  -6.718188 0.336223 0.008603
H  1.655864 -1.473688 0.099642
H  -2.503633 1.318447 -0.077584
H  4.295848 2.650152 -0.071692
H  1.19316 -3.386282 0.681066
H  0.081439 5.22835 -0.246815
H  -2.767634 -2.348272 0.042135
H  3.395496 0.396181 2.155522
H  3.373779 0.194623 -2.115343
H  4.35744 5.096103 -0.198957
H  2.255499 6.405777 -0.287369
H  -0.480974 -4.784582 1.87704
H  0.619062 -5.774007 0.913169
H  -1.021851 -5.454532 0.33386
H  1.527625 -4.852464 -1.303567
H  1.133046 -3.203158 -1.803611
H  -0.101371 -4.466955 -1.870181
H  5.47345 -0.960802 2.209767
H  5.451278 -1.163099 -2.062939
H  -3.97815 0.120846 1.972131
H  -4.673532 -1.555513 -1.902234
H  -6.245265 1.121164 1.945214
H  -6.950643 -0.579358 -1.914164
H  -1.077832 3.156557 -0.152705
totalener: -2182.02711048 hartree
nucrepener: 3385.24260157 hartree
electener: -5567.26971205 hartree
oneelecener: -9686.47523796 hartree
twoeener: 4119.20552591 hartree
kineticenergy: 2173.97462743 hartree
xcener: -167.599262859029 hartree
chargesum: 1.0000000
charge: -0.023197 -0.027259 0.087104 -0.088970 -0.081432 -0.315525 -0.022795 0.097993 0.138909 -0.049372 0.210415 -0.004653 0.005227 -0.085129 -0.062645 -0.131160 0.051531 -0.101290 -0.170103 -0.177982 -0.116827 -0.108959 0.177686 -0.211442 -0.245880 -0.067400 -0.067555 0.080400 -0.263811 -0.196351 -0.062218 -0.076604 0.050472 0.124561 0.128273 0.146642 0.054359 0.116945 0.181120 0.134299 0.134156 0.147132 0.147374 0.090300 0.090616 0.086012 0.102357 0.081643 0.098961 0.139955 0.139925 0.151214 0.139826 0.139095 0.139214 0.144844
charge: 0.445893 0.443007 0.323568 0.420233 0.409740 0.218892 -0.095436 -0.061528 -0.104949 -0.007798 -0.176520 -0.118492 -0.067205 -0.028597 -0.136739 0.013278 -0.172698 0.004146 0.010891 0.010403 0.012871 0.004208 -0.137598 0.013988 0.020702 -0.015335 -0.015553 -0.387057 0.001997 0.011116 -0.019064 -0.013158 -0.388705 0.023368 0.026242 0.032298 0.017779 0.028155 -0.004196 0.035597 0.035453 0.033213 0.031337 0.014871 0.019985 0.018025 0.022977 0.010793 0.020091 0.032557 0.032481 0.032572 0.032513 0.031367 0.032589 0.021431
qa: -0.0232 -0.0273 0.0871 -0.0890 -0.0814 -0.3155 -0.0228 0.0980 0.1389 -0.0494 0.2104 -0.0047 0.0052 -0.0851 -0.0626 -0.1312 0.0515 -0.1013 -0.1701 -0.1780 -0.1168 -0.1090 0.1777 -0.2114 -0.2459 -0.0674 -0.0676 0.0804 -0.2638 -0.1964 -0.0622 -0.0766 0.0505 0.1246 0.1283 0.1466 0.0544 0.1169 0.1811 0.1343 0.1342 0.1471 0.1474 0.0903 0.0906 0.0860 0.1024 0.0816 0.0990 0.1400 0.1399 0.1512 0.1398 0.1391 0.1392 0.1448
va: 1.2823 1.2775 3.1054 3.5186 3.3311 2.9674 4.2327 4.2068 3.9584 3.7433 3.9275 4.0226 4.3305 3.8967 3.6456 3.9238 3.9177 3.9837 4.0734 4.0754 3.9983 4.0232 3.5966 3.8960 3.9165 3.9374 3.9387 4.0103 4.0624 4.0990 3.9589 3.9701 4.0306 1.0189 1.0168 1.0050 1.0062 1.0123 1.0452 1.0154 1.0154 0.9973 0.9976 1.0117 1.0111 1.0128 1.0089 1.0053 1.0100 1.0100 1.0099 1.0021 1.0102 1.0080 1.0080 1.0262
dispcorr: -0.029497648 hartree
energy: -2182.061436732139
dipole: 6.53746 -6.54906 -0.01161 -12.82732 14.10494 1.27762 -1.54844 1.42092 -0.12752
magnitude: 1.28402 au
magnitude: 3.26372 debye
temp: 298.15 k
press: 1.00 atm
zeropoint: 0.44852618 hartree
thermalvibcorrection: 0.02518573 hartree
thermalrotcorrection: 0.00141627 hartree
thermaltrasncorrection: 0.00141627 hartree
thermaltotal: -2181.58489228 hartree
thermalcorr: 0.02801827 hartree
nonthermalcorr: 0.44852618 hartree
totalcorr: 0.47654446 hartree
thermalcorrenthalpy: 0.00094421 hartree
totalenthalpy: -2181.58394807 hartree
totalentropycorr: -0.08473774 hartree
gibbsenthalpy: -2181.66868581 hartree
gibbsminuselec: 0.39275093 hartree
