program: Orca
programVersion: 5.0.2
elementType: Cl O O O O O O O O N N C C C C C C C C C C C C C C C C C C C C C H H H H H H H H H H H H H H H H H H H H H C H H H
charge: 1
multiplicity: 1
keywords: wB97X-D3 TightOpt Freq def2-TZVPP def2/J RIJCOSX TightSCF defgrid3 CHELPG
frequency: 0.00 0.00 0.00 0.00 0.00 0.00 20.39 27.04 45.73 54.55 69.37 76.00 87.14 91.10 113.26 115.91 122.15 141.06 158.29 166.85 190.11 194.94 201.42 217.81 229.79 239.48 245.30 262.54 272.18 286.62 297.23 308.95 321.73 326.31 329.68 352.74 357.06 366.05 374.31 385.32 395.67 404.30 407.72 419.75 439.42 466.86 475.06 479.42 508.06 518.52 523.20 529.00 543.48 553.79 569.63 578.77 582.46 613.01 626.71 651.96 664.95 671.40 685.34 709.78 726.38 745.75 751.06 761.74 777.38 784.86 786.83 799.98 813.40 834.98 841.58 847.15 884.35 895.33 905.44 918.16 938.01 956.88 975.13 992.17 1018.29 1018.58 1033.73 1053.62 1064.02 1071.96 1085.34 1094.73 1106.61 1119.25 1125.81 1131.83 1157.74 1167.62 1172.85 1193.40 1199.20 1201.88 1218.60 1229.19 1235.06 1244.09 1254.46 1285.56 1295.47 1302.42 1319.66 1328.91 1331.29 1339.27 1350.11 1371.60 1377.75 1387.23 1392.81 1405.02 1409.86 1416.07 1418.43 1431.20 1443.07 1458.39 1468.14 1471.10 1490.09 1493.35 1497.02 1498.15 1501.36 1504.12 1509.17 1515.31 1516.19 1517.72 1551.14 1562.65 1583.32 1628.09 1642.26 1668.41 1679.97 1724.74 1770.74 3015.74 3026.72 3028.00 3037.74 3083.27 3093.31 3103.13 3125.81 3127.22 3147.35 3161.48 3164.77 3174.52 3190.64 3223.30 3226.72 3244.89 3272.86 3431.23 3479.66 3493.59 3706.52 3813.89 3896.86
frequency: 20.39 27.04 45.73 54.55 69.37 76.00 87.14 91.10 113.26 115.91 122.15 141.06 158.29 166.85 190.11 194.94 201.42 217.81 229.79 239.48 245.30 262.54 272.18 286.62 297.23 308.95 321.73 326.31 329.68 352.74 357.06 366.05 374.31 385.32 395.67 404.30 407.72 419.75 439.42 466.86 475.06 479.42 508.06 518.52 523.20 529.00 543.48 553.79 569.63 578.77 582.46 613.01 626.71 651.96 664.95 671.40 685.34 709.78 726.38 745.75 751.06 761.74 777.38 784.86 786.83 799.98 813.40 834.98 841.58 847.15 884.35 895.33 905.44 918.16 938.01 956.88 975.13 992.17 1018.29 1018.58 1033.73 1053.62 1064.02 1071.96 1085.34 1094.73 1106.61 1119.25 1125.81 1131.83 1157.74 1167.62 1172.85 1193.40 1199.20 1201.88 1218.60 1229.19 1235.06 1244.09 1254.46 1285.56 1295.47 1302.42 1319.66 1328.91 1331.29 1339.27 1350.11 1371.60 1377.75 1387.23 1392.81 1405.02 1409.86 1416.07 1418.43 1431.20 1443.07 1458.39 1468.14 1471.10 1490.09 1493.35 1497.02 1498.15 1501.36 1504.12 1509.17 1515.31 1516.19 1517.72 1551.14 1562.65 1583.32 1628.09 1642.26 1668.41 1679.97 1724.74 1770.74 3015.74 3026.72 3028.00 3037.74 3083.27 3093.31 3103.13 3125.81 3127.22 3147.35 3161.48 3164.77 3174.52 3190.64 3223.30 3226.72 3244.89 3272.86 3431.23 3479.66 3493.59 3706.52 3813.89 3896.86
formula: C22H24ClN2O8
InChI: InChI=1S/C22H24ClN2O8/c1-21(32)7-6-8-15(25(2)3)17(28)13(20(24)31)19(30)22(8,33)18(29)11(7)16(27)12-10(26)5-4-9(23)14(12)21/h4-5,7-8,15,26-27,29,31-33H,6,24H2,1-3H3
57 atoms
Cl 4.76426 -2.76737 0.729077
O  -2.30509 1.894377 -1.493988
O  1.667819 -1.699997 1.244989
O  -0.378926 2.862854 0.075448
O  -2.473434 2.141664 1.339327
O  2.112392 2.881059 -0.001259
O  -3.943134 -2.264111 0.642847
O  4.652809 2.948626 -0.356231
O  -3.930649 1.092821 3.113361
N  -3.89814 -0.338157 -1.988995
N  -4.624486 -1.005764 2.879977
C  -1.570273 -0.401715 -1.191478
C  -1.701511 0.99464 -0.593153
C  -0.46755 -1.19608 -0.509864
C  0.891329 -0.544335 -0.765929
C  -2.933559 -1.096298 -1.165013
C  0.841961 0.910658 -0.375853
C  -0.341987 1.588684 -0.282397
C  2.036073 -1.335862 -0.077747
C  -2.527537 1.055991 0.714983
C  -3.424293 -1.222354 0.275831
C  -3.284978 -0.053774 1.125111
C  3.345452 -0.529573 -0.023212
C  2.077489 1.581652 -0.189005
C  3.330439 0.899498 -0.182055
C  -5.296337 -0.593024 -1.644863
C  -3.690555 -0.622494 -3.408621
C  4.560496 -1.117021 0.263333
C  -3.957101 0.011635 2.392556
C  4.548539 1.63727 -0.188539
C  5.751528 -0.374601 0.22956
C  5.75727 0.964768 -0.024466
H  -1.281429 -0.250144 -2.233735
H  -0.481588 -2.218061 -0.883434
H  -0.634636 -1.263047 0.567063
H  1.104977 -0.588077 -1.840391
H  -2.838287 -2.126923 -1.53002
H  -3.101551 1.418104 -1.806211
H  -2.672563 -0.385626 -3.712128
H  -3.889409 -1.675262 -3.646805
H  -5.560601 -1.654284 -1.722175
H  -5.513554 -0.253705 -0.633361
H  -5.92838 -0.025675 -2.325194
H  -4.362107 -0.001805 -3.999257
H  1.812832 -0.968223 1.84606
H  -1.273065 3.035193 0.472672
H  1.205281 3.249949 0.058238
H  6.682603 -0.893077 0.41576
H  6.674596 1.535077 -0.056129
H  -4.637799 -1.860711 2.332111
H  -5.096642 -0.915409 3.763086
H  3.790861 3.375689 -0.360317
H  -3.401635 1.774879 2.620179
C  2.200608 -2.635851 -0.884356
H  2.964166 -2.527991 -1.652938
H  2.471809 -3.457217 -0.23356
H  1.272621 -2.902576 -1.382424
totalener: -2024.26747407 hartree
nucrepener: 3909.94304778 hartree
electener: -5934.21052185 hartree
twoeener: 4589.73977550 hartree
kineticenergy: 2016.01078475 hartree
xcener: -167.113565990565 hartree
chargesum: 1.0000000
charge: -0.010193 -0.339535 -0.306537 -0.297023 -0.484942 -0.277132 -0.361669 -0.242686 -0.256646 -0.255088 -0.196493 0.087016 0.375961 -0.492039 0.235192 0.096864 -0.303012 0.281879 0.288287 0.178364 0.159141 -0.325062 -0.073617 0.373268 -0.082174 -0.192615 -0.198067 -0.032941 0.362977 0.237940 -0.049143 -0.160278 0.094970 0.110930 0.134420 0.118950 0.120715 0.213877 0.104447 0.104083 0.120306 0.098707 0.107652 0.113812 0.175655 0.256108 0.227306 0.140650 0.149834 0.221860 0.185574 0.211456 0.244440 -0.342768 0.120493 0.129565 0.096961
charge: 0.486104 0.307407 0.326361 0.458373 0.156175 0.469821 0.147941 0.424268 0.417797 0.195990 0.438314 -0.053692 -0.237287 0.020534 -0.046841 -0.103768 -0.075020 -0.083079 -0.226826 -0.219937 -0.267003 -0.144064 -0.037331 -0.084913 -0.065724 -0.028037 -0.031741 -0.378525 -0.228110 -0.146046 0.020033 0.017699 0.043151 0.032588 0.033616 0.052471 0.040554 -0.151990 0.009261 0.011794 0.015200 0.014151 0.019520 0.020243 -0.133949 -0.108515 -0.149772 0.041640 0.041889 -0.038781 0.000256 -0.150277 -0.150441 0.027621 0.025083 0.011762 0.014052
qa: -0.0102 -0.3395 -0.3065 -0.2970 -0.4849 -0.2771 -0.3617 -0.2427 -0.2566 -0.2551 -0.1965 0.0870 0.3760 -0.4920 0.2352 0.0969 -0.3030 0.2819 0.2883 0.1784 0.1591 -0.3251 -0.0736 0.3733 -0.0822 -0.1926 -0.1981 -0.0329 0.3630 0.2379 -0.0491 -0.1603 0.0950 0.1109 0.1344 0.1190 0.1207 0.2139 0.1044 0.1041 0.1203 0.0987 0.1077 0.1138 0.1757 0.2561 0.2273 0.1407 0.1498 0.2219 0.1856 0.2115 0.2444 -0.3428 0.1205 0.1296 0.0970
va: 1.3113 2.1261 2.0900 2.2684 2.0395 2.2741 2.1246 2.2863 2.2897 3.0379 3.3736 3.6305 4.1026 4.0844 3.6060 3.7983 3.6452 3.6839 3.9489 4.0875 4.0078 3.4852 3.6422 3.8141 3.5506 3.9273 3.9277 4.0518 4.1841 4.0695 4.0083 3.9640 1.0325 1.0248 1.0223 0.9998 1.0126 1.0940 0.9976 1.0033 1.0018 0.9944 0.9982 0.9990 1.0504 1.0619 1.0927 1.0084 1.0090 1.0434 1.0134 1.0727 1.0904 3.8958 0.9943 1.0210 1.0106
dispcorr: -0.037266654 hartree
energy: -2024.309616000210
dipole: -28.99433 28.60779 -0.38653 -5.40715 6.09401 0.68686 -16.62479 16.53190 -0.09289
magnitude: 0.79360 au
magnitude: 2.01718 debye
temp: 298.15 k
press: 1.00 atm
zeropoint: 0.45637953 hartree
thermalvibcorrection: 0.02637363 hartree
thermalrotcorrection: 0.00141627 hartree
thermaltrasncorrection: 0.00141627 hartree
thermaltotal: -2023.82403029 hartree
thermalcorr: 0.02920618 hartree
nonthermalcorr: 0.45637953 hartree
totalcorr: 0.48558571 hartree
thermalcorrenthalpy: 0.00094421 hartree
totalenthalpy: -2023.82308608 hartree
totalentropycorr: -0.08441376 hartree
gibbsenthalpy: -2023.90749985 hartree
gibbsminuselec: 0.40211615 hartree
