program: Gaussian 09
title: 000044727
version: EM64L-G09RevD.01
frameworkgroup: C1[X(C20H24N2O)]
method: RPBEPBE
basis: SDD
operation: Freq
keyword: #p
keyword: freq=noraman
keyword: PBEPBE/SDD
title: #p freq=noraman PBEPBE/SDD
converged: YES YES NO NO
title: Mulliken charges:
elementType: O N N C C C C C C C C C C C C C C C C C C C C H H H H H H H H H H H H H H H H H H H H H H H H
charge: -0.248761 -0.101443 -0.367684 -0.033079 -0.502699 -0.166720 -0.496606 0.233246 0.234081 0.359782 0.163822 -0.337625 -0.354289 -0.374185 -0.403508 -0.651315 -0.636005 -0.281626 -0.257446 -0.253038 -0.253817 -0.245675 -0.617463 0.212516 0.203823 0.214911 0.213873 0.248647 0.249529 0.273065 0.222560 0.267253 0.280949 0.186977 0.211019 0.223094 0.189772 0.217703 0.221820 0.223337 0.321081 0.225713 0.229071 0.230725 0.224743 0.275328 0.224546
chargesum: 0.00000
title: Mulliken charges with hydrogens summed into heavy atoms:
elementType: O N N C C C C C C C C C C C C C C C C C C C C
charge: -0.248761 -0.101443 -0.046603 -0.033079 -0.086359 0.048190 -0.034085 0.233246 0.234081 0.359782 0.163822 -0.088095 -0.081225 -0.151625 -0.136255 0.027630 -0.005436 -0.059806 -0.034109 -0.027325 -0.024746 -0.014950 0.107154
polarizability: 2.79395159e+02 -1.91014714e+00 2.05058240e+02 -2.25887161e+00 9.24949478e+00 1.89489677e+02
1716.lowfreq: -5.8834 -3.5580 -0.0008 -0.0006 0.0002 8.6995 29.9943 32.6539 56.5555
frequency: 29.7587 32.5785 56.5447 63.3400 73.8853 84.9580 92.1478 99.6085 102.2713 137.2698 191.8709 198.1502 213.0682 220.9183 228.6209 238.3849 253.1478 264.8601 301.6061 310.2643 330.4005 341.1236 368.4792 377.1484 403.6069 420.5039 455.7458 462.1047 480.6404 505.4095 526.6299 557.4761 584.9764 617.3250 626.6986 628.8454 652.1761 702.9911 707.0990 711.0046 755.9892 762.5811 781.6932 789.5246 830.4674 837.1041 855.2321 887.6743 906.5636 915.8653 932.5183 953.7672 970.2734 981.0705 990.7748 994.2181 997.4764 1014.4499 1028.5010 1034.6119 1038.1591 1045.0189 1047.9357 1075.7566 1082.7243 1091.1211 1105.5499 1113.1795 1120.1104 1137.6490 1141.6819 1165.5963 1174.2401 1175.2930 1184.5494 1185.6456 1199.4367 1203.7471 1211.9051 1222.1993 1255.2838 1268.0950 1277.6334 1317.0672 1324.9744 1330.4405 1342.4953 1353.8399 1373.3875 1376.3728 1415.5410 1422.7120 1432.8868 1434.5072 1441.4752 1454.9620 1456.3814 1461.7430 1465.7827 1477.5617 1479.2648 1481.8064 1484.4747 1486.2114 1496.0744 1513.0293 1583.8364 1585.1754 1605.0849 1609.6147 1613.9021 2853.6538 2883.3563 2923.9615 2975.0912 2987.1270 2999.8812 3002.2978 3015.6290 3044.3513 3053.4835 3057.8326 3061.8961 3096.5716 3108.8260 3120.0675 3120.7194 3128.5044 3134.7294 3140.9023 3148.0092 3153.6902 3160.9212 3166.0346 3544.1343
redmass: 4.0420 3.8956 4.6624 3.5858 3.0929 3.5405 2.1177 1.6048 2.8204 3.2236 3.7443 3.0354 1.1516 2.7702 1.2885 4.1910 3.4372 3.6412 3.1524 3.3298 2.8181 3.7763 3.0284 5.7583 2.8213 3.2474 4.2703 3.8342 3.4046 3.9194 3.3852 3.1776 1.1625 6.2585 3.7507 4.8197 4.9707 2.8686 1.9611 5.9370 2.2439 1.7535 2.3025 2.7522 2.4833 3.7012 1.2663 1.4411 2.7509 1.8800 1.9147 2.7096 1.5512 1.3903 4.6621 1.3720 1.3606 3.2732 2.9487 2.4686 2.4480 1.5414 2.3733 2.0590 2.6485 1.2728 2.1627 1.8859 1.2952 1.6650 1.4425 1.7755 1.0806 1.2214 2.3205 1.6788 2.0157 1.1773 2.7814 2.2002 1.6598 2.2419 1.6084 1.4260 1.3838 1.4222 1.4047 1.4942 5.2612 6.0480 1.1839 1.1370 2.2220 2.2516 1.1443 1.2690 1.0590 1.1196 1.0798 1.5400 1.4250 1.0592 2.0624 1.0619 1.0560 1.3690 6.9875 5.9260 6.7976 6.1791 6.3502 1.0565 1.0554 1.0824 1.0354 1.0588 1.0642 1.0687 1.0773 1.1013 1.1017 1.1022 1.1007 1.0980 1.0979 1.0848 1.0853 1.0873 1.0893 1.0930 1.0940 1.0947 1.0990 1.1002 1.0772
irintensity: 0.1079 0.9879 2.8358 2.8388 2.9942 0.9060 1.0226 1.1212 0.1009 0.9682 0.5938 1.1243 2.4136 1.0959 0.1439 0.4783 0.1057 1.0966 3.4764 1.4997 4.5643 9.2688 5.1658 7.8065 0.1776 1.0920 7.0086 5.4545 8.9618 1.5631 8.5922 14.8469 100.0767 0.9342 0.8471 8.0652 9.5940 11.7529 40.3614 2.7960 30.3682 32.4573 26.4263 10.0452 2.2191 9.9913 0.5632 0.8595 1.8942 20.1270 8.7184 4.6410 3.1047 0.3963 1.3465 1.4492 0.2773 33.0178 16.9221 7.0814 18.6194 15.0628 10.0942 8.1028 4.3971 11.0039 6.1343 3.5327 0.4009 61.8221 0.6788 3.8138 0.6309 2.6006 5.4426 4.8050 3.8391 0.3492 11.9798 63.9080 2.6417 6.6149 0.4507 7.2624 0.5108 6.0464 1.2343 12.5712 0.1660 0.8342 29.9146 6.7173 7.2810 12.7239 11.3316 73.0841 12.2797 13.0222 14.4771 31.9371 16.0083 11.6830 26.4948 10.3748 6.8173 91.0757 2.1484 10.7367 134.9280 4.4008 20.1121 113.7166 122.2047 24.0222 84.7153 40.0925 54.2882 37.9987 55.1210 39.1207 33.2763 24.1969 46.6365 18.6784 2.0060 0.3995 5.8614 1.1771 8.4915 22.6101 21.9160 34.6149 32.2247 18.8361 17.9087
temp: 298.150 k
press: 1.00000 atm
elementType: 8 7 7 6 6 6 6 6 6 6 6 6 6 6 6 6 6 6 6 6 6 6 6 1 1 1 1 1 1 1 1 1 1 1 1 1 1 1 1 1 1 1 1 1 1 1 1
symmnumber: 1
zpe: 1035360.6 jmol-1
zpe.correction: 0.394348 hartree
zpe.thermalcorrener: 0.416200 hartree
zpe.thermalcorrenthalpy: 0.417144 hartree
zpe.thermalcorrgfe: 0.343446 hartree
zpe.sumelectzpe: -959.564132 hartree
zpe.sumelectthermal: -959.542280 hartree
zpe.sumelectthermalent: -959.541336 hartree
zpe.sumelectthermalfe: -959.615034 hartree
dipole: 2.7228 2.1469 2.5678
dipole: 4.3147
quadrupole: -124.5886 -129.4950 -135.1842
quadrupole: 1.6507 -4.9204 1.4883
quadrupole: 5.1673 0.2609 -5.4283 1.6507 -4.9204 1.4883
hfenergy: -959.95848 hartree
pointgroup: C01 [X(C20H24N2O1)]
dipole: 1.15774 0.765872 0.9770703 debye
polarizability: 278.4786297|-7.8268517|206.1116027|-3.2314154|9.3605626|189.3528434 unknown
InChI: InChI=1S/C20H24N2O/c1-21-19(23)20(15-9-5-4-6-10-15)14-13-18(22(2)3)16-11-7-8-12-17(16)20/h4-12,18,21H,13-14H2,1-3H3
charge 0 multiplicity 1
47 atoms
O  -0.355029 1.553481 -1.754176
N  -3.761139 0.55674 0.619594
N  1.397286 2.553934 -0.60784
C  0.567228 0.361429 0.244537
C  -0.014175 0.960208 1.570782
C  -2.391054 0.204215 1.088858
C  -1.469734 1.421812 1.380271
C  -0.360487 -0.789295 -0.224031
C  -1.736424 -0.820676 0.144005
C  2.024164 -0.128674 0.433859
C  0.500084 1.518511 -0.819417
C  0.145607 -1.814456 -1.062485
C  -2.554418 -1.876433 -0.332626
C  2.460051 -0.698933 1.658872
C  2.952563 -0.095125 -0.643657
C  -3.816924 1.287563 -0.663657
C  -4.614105 1.159247 1.656918
C  -0.677136 -2.85654 -1.53374
C  -2.041587 -2.888134 -1.166829
C  3.772744 -1.19924 1.808814
C  4.265357 -0.594333 -0.499302
C  4.685355 -1.14771 0.731393
C  1.442859 3.745691 -1.462456
H  0.622196 1.796208 1.91712
H  0.006177 0.184329 2.359744
H  -2.546811 -0.321033 2.058294
H  -1.820437 1.93896 2.29305
H  -1.531702 2.147687 0.549147
H  1.202646 -1.806546 -1.344662
H  -3.612914 -1.859455 -0.050245
H  1.773717 -0.768905 2.508346
H  2.645936 0.322906 -1.609555
H  -3.121981 0.829463 -1.386243
H  -3.548264 2.368503 -0.576754
H  -4.843241 1.22789 -1.071881
H  -5.6576 1.20088 1.292639
H  -4.321578 2.200564 1.945648
H  -4.595192 0.534198 2.569152
H  -0.256724 -3.635035 -2.180519
H  -2.6955 -3.691133 -1.525837
H  2.110049 2.438645 0.11496
H  4.079714 -1.633811 2.766976
H  4.956158 -0.556002 -1.349273
H  5.703321 -1.536049 0.846917
H  1.329037 4.668869 -0.86498
H  0.607036 3.672917 -2.17656
H  2.391169 3.802669 -2.029971
