program: Gaussian 09
title: 000005195
version: EM64L-G09RevD.01
frameworkgroup: C1[X(C13H17N)]
method: RPBEPBE
basis: SDD
operation: Freq
keyword: #pfreq=noraman
keyword: PBEPBE/SDD
title: #p freq=noraman PBEPBE/SDD
converged: YES YES NO NO
title: Mulliken charges:
elementType: N C C C C C C C C C C C C C H H H H H H H H H H H H H H H H H
charge: -0.101276 -0.062581 -0.576749 -0.733731 0.499615 -0.431579 -0.636867 -0.431420 -0.398091 -0.229658 -0.233992 -0.243672 0.210994 -0.505452 0.230792 0.199506 0.235347 0.223155 0.210489 0.247691 0.211984 0.240360 0.222641 0.250402 0.186460 0.230735 0.234700 0.223796 0.223636 0.227545 0.275222
chargesum: 0.00000
title: Mulliken charges with hydrogens summed into heavy atoms:
elementType: N C C C C C C C C C C C C C
charge: -0.101276 0.168210 -0.141896 -0.052396 0.499615 0.020765 0.022637 -0.200685 -0.163391 -0.005862 -0.010356 -0.016128 0.210994 -0.230231
polarizability: 2.00396045e+02 -4.05830079e+00 1.21411054e+02 -1.67813094e+01 -1.21897237e+01 1.02697374e+02
1716.lowfreq: -11.6694 -6.6602 -0.0004 0.0002 0.0003 9.9723 18.5087 42.2397 51.7779
frequency: 18.1734 42.1950 51.6924 73.1647 94.1873 137.6845 193.9659 205.6440 216.1396 234.3483 240.0134 291.2801 320.3183 354.2214 373.0328 404.5902 409.6720 462.1650 519.9742 539.3364 610.2220 618.3652 628.3533 657.4254 706.5652 746.9503 774.9782 822.8156 849.0682 856.0113 892.4185 916.1004 926.1729 957.7276 976.6432 990.0794 993.4592 998.5060 1026.7981 1043.3131 1048.4037 1092.5378 1107.4322 1122.7172 1138.0445 1171.5249 1187.3980 1192.7879 1214.6275 1216.5700 1268.8862 1294.6292 1311.3201 1332.7523 1342.4083 1364.8867 1381.5693 1383.4933 1431.3971 1440.4955 1454.3695 1463.3967 1468.9387 1476.4327 1479.1357 1484.1418 1490.1336 1592.5774 1613.7003 2142.2518 2838.6167 2868.2642 2977.4266 2981.5829 2991.6197 3024.5564 3026.7056 3049.9428 3070.4900 3081.1169 3084.6827 3113.3462 3115.0100 3130.8186 3142.1965 3161.1481 3427.1638
redmass: 3.9376 3.9291 3.5983 2.8171 3.4015 3.5088 3.3156 1.1193 1.1134 3.1978 3.3048 2.9690 2.8716 1.9752 2.8674 2.8333 3.6035 3.4388 2.8026 3.9698 4.1569 6.1482 1.2309 1.2506 1.8457 1.9354 3.4753 3.1804 2.4336 1.3081 1.3987 1.6418 2.2333 1.8529 1.3883 6.0534 1.3609 2.1077 2.1938 1.6342 2.1852 1.6074 1.4999 2.2168 1.9640 1.0533 1.1168 1.8098 1.6166 2.0832 1.4549 1.5043 1.3489 1.2663 1.3339 1.3279 1.8788 2.3188 1.1524 2.1504 1.0763 1.0575 1.0762 1.1124 1.1021 1.9800 1.0527 6.0132 6.1518 6.0196 1.0704 1.0559 1.0365 1.0701 1.0727 1.0831 1.0741 1.1019 1.0992 1.0989 1.1009 1.0868 1.0868 1.0908 1.0958 1.1014 1.1593
irintensity: 0.0993 0.0571 0.0370 0.6105 0.3851 1.3813 0.8583 0.1176 0.5732 2.2618 1.0284 0.1975 6.8466 0.8797 5.7046 0.0198 2.6948 6.9963 6.9520 7.7824 6.5796 0.5791 76.8494 63.6685 49.7847 32.8577 28.5483 5.0525 4.0269 0.7713 3.2363 0.7097 1.5089 11.2057 0.1026 0.2334 1.3467 22.5667 7.6711 3.4578 39.8629 12.2413 14.7107 23.1850 57.8558 0.2280 0.1696 25.7337 13.0867 7.1004 5.2348 15.8433 2.0447 1.8713 2.3889 14.5269 20.6464 14.0944 8.8183 7.7162 0.6718 16.7044 3.8968 5.7087 20.1561 13.2828 7.9917 1.5542 11.7304 3.0415 66.9247 127.2400 21.5995 5.5926 40.5371 20.4502 27.0145 18.2684 39.2690 34.8357 32.2210 8.6156 7.8806 11.2148 45.0571 25.0449 66.4063
temp: 298.150 k
press: 1.00000 atm
elementType: 7 6 6 6 6 6 6 6 6 6 6 6 6 6 1 1 1 1 1 1 1 1 1 1 1 1 1 1 1 1 1
symmnumber: 1
zpe: 687657.9 jmol-1
zpe.correction: 0.261915 hartree
zpe.thermalcorrener: 0.276820 hartree
zpe.thermalcorrenthalpy: 0.277764 hartree
zpe.thermalcorrgfe: 0.218609 hartree
zpe.sumelectzpe: -559.196051 hartree
zpe.sumelectthermal: -559.181146 hartree
zpe.sumelectthermalent: -559.180202 hartree
zpe.sumelectthermalfe: -559.239357 hartree
dipole: -0.4290 0.1406 1.2022
dipole: 1.2842
quadrupole: -80.7984 -80.7336 -87.4760
quadrupole: -0.1551 -0.4937 -2.6449
quadrupole: 2.2043 2.2691 -4.4734 -0.1551 -0.4937 -2.6449
hfenergy: -559.4579661 hartree
pointgroup: C01 [X(C13H17N1)]
dipole: 0.1662986 0.4642036 0.1101024 debye
polarizability: 200.2307725|16.7132484|105.9960081|5.8776482|-14.0432388|118.2776921 unknown
InChI: InChI=1S/C13H17N/c1-4-10-14(3)12(2)11-13-8-6-5-7-9-13/h1,5-9,12H,10-11H2,2-3H3
charge 0 multiplicity 1
31 atoms
N  -2.123763 0.033359 0.547569
C  -0.697531 0.482261 0.485447
C  0.110684 -0.408021 -0.50956
C  -0.502788 1.995453 0.194375
C  1.616776 -0.293615 -0.320569
C  -2.911497 0.318885 -0.678704
C  -2.827971 0.448556 1.778166
C  2.424514 0.437678 -1.228683
C  2.246943 -0.912464 0.791926
C  3.820109 0.553668 -1.03187
C  3.640121 -0.800142 0.993854
C  4.433293 -0.064284 0.081927
C  -4.168962 -0.454468 -0.747603
C  -5.232536 -1.071792 -0.834871
H  -0.290754 0.273475 1.495427
H  -0.14991 -0.139484 -1.55181
H  -0.222932 -1.449266 -0.340763
H  -1.057509 2.619576 0.918629
H  -0.848933 2.256746 -0.823329
H  0.566146 2.263849 0.263255
H  -3.173984 1.403742 -0.777111
H  -2.295778 0.060448 -1.559933
H  -2.240406 0.135328 2.659151
H  -3.808313 -0.056789 1.822886
H  -3.008208 1.550259 1.851157
H  1.956277 0.915842 -2.09832
H  1.640175 -1.495626 1.496663
H  4.426982 1.12105 -1.746871
H  4.108608 -1.289832 1.855386
H  5.515011 0.021213 0.234996
H  -6.153264 -1.621105 -0.907217
