program: Orca
programVersion: 5.0.2
elementType: C C C N H N C F F F C C C C H C H C H H C H H H C C C C H C H C H H S O O N H H H
charge: 1
multiplicity: 1
keywords: wB97X-D3 TightOpt Freq def2-TZVPP def2/J RIJCOSX TightSCF defgrid3 CHELPG
frequency: 0.00 0.00 0.00 0.00 0.00 0.00 9.38 23.38 27.51 31.73 38.54 42.01 58.04 65.02 90.74 109.73 135.81 147.08 172.07 186.04 205.83 218.71 242.40 274.13 294.62 317.01 342.19 365.16 371.03 383.34 407.61 418.14 421.09 425.11 439.28 459.01 484.22 495.68 510.35 522.28 553.57 560.73 575.84 597.82 626.90 634.95 645.91 656.87 724.88 743.59 754.86 756.54 761.75 780.27 827.29 859.24 864.17 881.91 885.71 889.62 912.01 987.56 997.70 1000.44 1002.31 1014.79 1016.80 1025.22 1031.61 1033.25 1052.02 1060.61 1075.02 1101.52 1129.43 1133.97 1143.68 1149.25 1167.52 1196.34 1216.90 1222.47 1227.01 1252.14 1256.05 1277.35 1309.35 1325.25 1348.59 1349.69 1371.90 1411.09 1425.94 1426.75 1456.85 1479.02 1495.13 1496.50 1505.05 1531.96 1559.87 1580.33 1598.45 1635.21 1646.89 1663.37 1669.47 1703.05 3067.42 3136.30 3157.77 3191.50 3198.60 3208.36 3214.95 3224.82 3229.22 3257.03 3260.05 3296.01 3566.39 3692.72 3775.42
frequency: 9.38 23.38 27.51 31.73 38.54 42.01 58.04 65.02 90.74 109.73 135.81 147.08 172.07 186.04 205.83 218.71 242.40 274.13 294.62 317.01 342.19 365.16 371.03 383.34 407.61 418.14 421.09 425.11 439.28 459.01 484.22 495.68 510.35 522.28 553.57 560.73 575.84 597.82 626.90 634.95 645.91 656.87 724.88 743.59 754.86 756.54 761.75 780.27 827.29 859.24 864.17 881.91 885.71 889.62 912.01 987.56 997.70 1000.44 1002.31 1014.79 1016.80 1025.22 1031.61 1033.25 1052.02 1060.61 1075.02 1101.52 1129.43 1133.97 1143.68 1149.25 1167.52 1196.34 1216.90 1222.47 1227.01 1252.14 1256.05 1277.35 1309.35 1325.25 1348.59 1349.69 1371.90 1411.09 1425.94 1426.75 1456.85 1479.02 1495.13 1496.50 1505.05 1531.96 1559.87 1580.33 1598.45 1635.21 1646.89 1663.37 1669.47 1703.05 3067.42 3136.30 3157.77 3191.50 3198.60 3208.36 3214.95 3224.82 3229.22 3257.03 3260.05 3296.01 3566.39 3692.72 3775.42
formula: C17H15F3N3O2S
InChI: InChI=1S/C17H15F3N3O2S/c1-11-2-4-12(5-3-11)15-10-16(17(18,19)20)22-23(15)13-6-8-14(9-7-13)26(21,24)25/h2-10,24H,21H2,1H3
41 atoms
C  -3.004674 -1.561572 -0.040468
C  -3.266182 -0.177764 0.044181
C  -2.037845 0.4169 0.014428
N  -1.122747 -0.614083 -0.070228
H  -4.221413 0.317277 0.072326
N  -1.726976 -1.820126 -0.115333
C  -4.010411 -2.679089 -0.019616
F  -3.511157 -3.807379 -0.513559
F  -5.086873 -2.343456 -0.738757
F  -4.421428 -2.920344 1.231371
C  -1.701859 1.850074 -0.023508
C  -2.068845 2.681211 1.029487
C  -1.044992 2.399684 -1.121486
C  -1.769771 4.033134 0.988226
H  -2.583606 2.264882 1.88658
C  -0.749861 3.750679 -1.153312
H  -0.776363 1.768946 -1.960788
C  -1.105836 4.591214 -0.10032
H  -2.060769 4.666279 1.817694
H  -0.245284 4.164808 -2.018028
C  -0.817494 6.064141 -0.156592
H  -1.658318 6.598619 -0.602987
H  -0.658481 6.476787 0.83878
H  0.063526 6.275372 -0.761192
C  0.274423 -0.601628 -0.051773
C  0.945587 -1.694719 -0.611925
C  0.991267 0.442136 0.537665
C  2.318576 -1.743235 -0.59642
H  0.368149 -2.495052 -1.049663
C  2.367764 0.403992 0.555605
H  0.477707 1.274606 0.992764
C  3.022552 -0.686733 -0.01454
H  2.832734 -2.583271 -1.044441
H  2.927512 1.209994 1.011094
S  4.735402 -0.712766 0.082465
O  5.229446 -1.566139 -1.130784
O  5.363797 0.551212 0.124255
N  5.096806 -1.60803 1.337443
H  6.074331 -1.689323 1.584255
H  4.48834 -2.377056 1.574535
H  5.310116 -1.038387 -1.939344
totalener: -1669.12727618 hartree
nucrepener: 2451.76531472 hartree
electener: -4120.89259090 hartree
oneelecener: -7139.03187506 hartree
twoeener: 3018.13928415 hartree
kineticenergy: 1662.29372834 hartree
xcener: -135.197507305629 hartree
chargesum: 1.0000000
charge: 0.006483 -0.143699 0.229574 0.161102 0.173505 -0.309204 0.504456 -0.150261 -0.158995 -0.157920 -0.159084 -0.127111 -0.179623 -0.148952 0.140555 -0.120727 0.127650 0.001138 0.130040 0.126314 -0.197218 0.113844 0.092326 0.087797 0.097228 -0.112817 -0.152246 -0.081474 0.164605 -0.053597 0.177021 -0.085851 0.159171 0.156245 0.805638 -0.230688 -0.342552 -0.193016 0.197711 0.201886 0.250748
charge: -0.213562 0.006817 -0.103396 0.270212 0.031182 0.120696 -0.659235 0.227147 0.213311 0.209441 -0.104309 0.008929 0.002673 0.009514 0.031744 0.004161 0.027344 -0.069343 0.030168 0.028066 0.031345 0.029694 0.023250 0.021676 -0.074468 0.041907 0.043707 -0.005837 0.040639 0.017920 0.042443 -0.282789 0.033770 0.041231 0.837069 0.185167 -0.166131 0.192444 -0.016043 -0.020492 -0.088063
qa: 0.0065 -0.1437 0.2296 0.1611 0.1735 -0.3092 0.5045 -0.1503 -0.1590 -0.1579 -0.1591 -0.1271 -0.1796 -0.1490 0.1406 -0.1207 0.1276 0.0011 0.1300 0.1263 -0.1972 0.1138 0.0923 0.0878 0.0972 -0.1128 -0.1522 -0.0815 0.1646 -0.0536 0.1770 -0.0859 0.1592 0.1562 0.8056 -0.2307 -0.3426 -0.1930 0.1977 0.2019 0.2507
va: 3.9913 3.9361 3.6343 3.2672 0.9983 2.8522 4.5208 1.1658 1.1471 1.1465 3.6328 3.9528 3.9535 3.9843 1.0099 3.9575 1.0115 3.8174 1.0062 1.0061 3.9149 0.9942 1.0039 1.0044 3.9688 4.0429 4.0317 3.9946 1.0285 4.0150 0.9882 3.7784 1.0059 1.0078 5.7154 2.2202 2.1699 3.2101 1.0140 1.0087 1.0081
dispcorr: -0.019894777 hartree
energy: -1669.155544002025
dipole: 22.50884 -16.25781 6.25103 32.66204 -32.51357 0.14847 0.56184 -0.44397 0.11787
magnitude: 6.25390 au
magnitude: 15.89616 debye
temp: 298.15 k
press: 1.00 atm
zeropoint: 0.30633585 hartree
thermalvibcorrection: 0.02069934 hartree
thermalrotcorrection: 0.00141627 hartree
thermaltrasncorrection: 0.00141627 hartree
thermaltotal: -1668.82567626 hartree
thermalcorr: 0.02353189 hartree
nonthermalcorr: 0.30633585 hartree
totalcorr: 0.32986774 hartree
thermalcorrenthalpy: 0.00094421 hartree
totalenthalpy: -1668.82473205 hartree
totalentropycorr: -0.07566449 hartree
gibbsenthalpy: -1668.90039655 hartree
gibbsminuselec: 0.25514746 hartree
