program: Orca
programVersion: 5.0.2
elementType: C C C N H N C F F F C C C C H C H C H H C H H H C C C C H C H C H H S O O N H H H
charge: 1
multiplicity: 1
keywords: wB97X-D3 TightOpt Freq def2-TZVPP def2/J RIJCOSX TightSCF defgrid3 CHELPG
frequency: 0.00 0.00 0.00 0.00 0.00 0.00 10.70 16.67 19.63 23.84 39.02 43.06 48.48 60.62 94.91 98.38 128.77 154.29 175.67 192.91 212.36 238.73 242.11 257.02 298.90 348.30 354.38 366.94 378.95 396.73 418.07 419.59 420.78 442.92 458.10 478.18 498.87 513.88 523.38 538.16 562.22 573.46 579.64 620.59 633.21 642.58 646.33 658.71 729.20 742.92 756.13 759.37 761.90 780.00 829.78 855.08 871.13 874.87 886.85 895.71 917.98 999.15 1003.52 1012.97 1016.69 1019.26 1025.75 1030.89 1045.45 1053.24 1074.84 1082.98 1096.46 1139.98 1142.23 1155.04 1162.82 1208.28 1220.44 1225.57 1230.63 1239.64 1254.61 1258.33 1277.71 1304.28 1324.06 1328.00 1335.09 1349.54 1356.03 1427.08 1455.05 1456.75 1466.25 1492.27 1495.23 1511.12 1523.25 1555.02 1569.85 1592.56 1593.41 1647.46 1650.84 1671.02 1680.67 1693.32 3069.50 3139.89 3164.42 3201.64 3205.22 3211.81 3217.38 3221.58 3224.80 3235.69 3238.57 3302.23 3589.50 3649.56 3702.56
frequency: 10.70 16.67 19.63 23.84 39.02 43.06 48.48 60.62 94.91 98.38 128.77 154.29 175.67 192.91 212.36 238.73 242.11 257.02 298.90 348.30 354.38 366.94 378.95 396.73 418.07 419.59 420.78 442.92 458.10 478.18 498.87 513.88 523.38 538.16 562.22 573.46 579.64 620.59 633.21 642.58 646.33 658.71 729.20 742.92 756.13 759.37 761.90 780.00 829.78 855.08 871.13 874.87 886.85 895.71 917.98 999.15 1003.52 1012.97 1016.69 1019.26 1025.75 1030.89 1045.45 1053.24 1074.84 1082.98 1096.46 1139.98 1142.23 1155.04 1162.82 1208.28 1220.44 1225.57 1230.63 1239.64 1254.61 1258.33 1277.71 1304.28 1324.06 1328.00 1335.09 1349.54 1356.03 1427.08 1455.05 1456.75 1466.25 1492.27 1495.23 1511.12 1523.25 1555.02 1569.85 1592.56 1593.41 1647.46 1650.84 1671.02 1680.67 1693.32 3069.50 3139.89 3164.42 3201.64 3205.22 3211.81 3217.38 3221.58 3224.80 3235.69 3238.57 3302.23 3589.50 3649.56 3702.56
formula: C17H15F3N3O2S
InChI: InChI=1S/C17H15F3N3O2S/c1-11-2-4-12(5-3-11)15-10-16(17(18,19)20)22-23(15)13-6-8-14(9-7-13)26(21,24)25/h2-10,22H,21H2,1H3
41 atoms
C  3.197238 -1.33007 0.003806
C  3.277778 0.040782 0.006069
C  1.960747 0.513321 -0.047547
N  1.153007 -0.563618 -0.071645
H  4.173019 0.637611 0.006879
N  1.909554 -1.675352 -0.049665
C  4.284125 -2.380149 0.007092
F  3.746399 -3.578946 0.252722
F  5.182292 -2.108722 0.940463
F  4.889213 -2.422917 -1.172786
C  1.486854 1.895085 -0.081877
C  0.434299 2.293034 -0.904714
C  2.132248 2.844392 0.708899
C  0.037062 3.615595 -0.924938
H  -0.06494 1.578791 -1.546664
C  1.718682 4.162244 0.686191
H  2.945069 2.548724 1.360879
C  0.667255 4.572445 -0.13105
H  -0.775997 3.914029 -1.574843
H  2.219892 4.886436 1.316077
C  0.246368 6.011232 -0.178352
H  0.837198 6.55149 -0.920824
H  -0.801735 6.111123 -0.455586
H  0.398804 6.501375 0.781946
C  -0.278789 -0.6726 -0.018783
C  -0.940014 -1.299362 -1.062728
C  -0.944615 -0.169856 1.086277
C  -2.316572 -1.430583 -0.992739
H  -0.393666 -1.671783 -1.920375
C  -2.321465 -0.292204 1.140534
H  -0.396785 0.30534 1.88891
C  -2.995196 -0.917645 0.101862
H  -2.862047 -1.936364 -1.777884
H  -2.872258 0.070226 1.997825
S  -4.7680 -1.110676 0.20101
O  -5.090225 -2.238539 -0.606987
O  -5.100888 -1.018352 1.582763
N  -5.333576 0.224439 -0.546029
H  -5.824117 0.8520 0.072682
H  -5.819268 0.025645 -1.407418
H  1.485995 -2.589933 0.001036
totalener: -1669.16029302 hartree
nucrepener: 2456.04788994 hartree
electener: -4125.20818295 hartree
oneelecener: -7145.92925027 hartree
twoeener: 3020.72106731 hartree
kineticenergy: 1662.30801827 hartree
xcener: -135.220974058745 hartree
chargesum: 1.0000000
charge: 0.023719 -0.118047 0.250065 0.127704 0.189970 -0.046362 0.528106 -0.153854 -0.126322 -0.126716 -0.030377 -0.175735 -0.134936 -0.106089 0.135714 -0.142344 0.140865 -0.000750 0.131894 0.134878 -0.191036 0.115681 0.093833 0.097960 -0.009358 -0.218922 -0.157244 -0.022273 0.163151 -0.043149 0.150791 -0.046850 0.153777 0.155677 0.842972 -0.430861 -0.430961 -0.291706 0.177477 0.178032 0.211627
charge: -0.112077 0.034420 -0.062661 0.333612 0.042973 0.400622 -0.667238 0.222590 0.251694 0.244949 -0.098689 0.020251 0.022413 0.018109 0.030184 0.021046 0.031961 -0.052103 0.032605 0.034087 0.038600 0.032852 0.025250 0.026727 -0.139650 0.004080 0.026484 0.016335 0.034385 0.020003 0.039419 -0.189908 0.039335 0.039647 0.649661 -0.235794 -0.235472 0.129321 -0.045732 -0.045575 0.021285
qa: 0.0237 -0.1180 0.2501 0.1277 0.1900 -0.0464 0.5281 -0.1539 -0.1263 -0.1267 -0.0304 -0.1757 -0.1349 -0.1061 0.1357 -0.1423 0.1409 -0.0008 0.1319 0.1349 -0.1910 0.1157 0.0938 0.0980 -0.0094 -0.2189 -0.1572 -0.0223 0.1632 -0.0431 0.1508 -0.0469 0.1538 0.1557 0.8430 -0.4309 -0.4310 -0.2917 0.1775 0.1780 0.2116
va: 4.0052 3.9356 3.7563 3.3037 0.9923 3.4422 4.5069 1.1605 1.1973 1.1914 3.5016 4.0028 4.0003 3.9758 1.0028 4.0235 1.0037 3.8537 1.0057 1.0064 3.9127 0.9948 1.0046 1.0036 3.6480 4.0337 4.0472 3.9935 1.0032 4.0101 1.0064 3.8888 1.0161 1.0153 5.9655 2.0751 2.0750 3.0946 1.0252 1.0247 1.0036
dispcorr: -0.020127630 hartree
energy: -1669.188866744322
dipole: -20.77512 22.15378 1.37867 34.51147 -32.64756 1.86391 -2.16528 1.49187 -0.67341
magnitude: 2.41420 au
magnitude: 6.13640 debye
temp: 298.15 k
press: 1.00 atm
zeropoint: 0.30828152 hartree
thermalvibcorrection: 0.02048250 hartree
thermalrotcorrection: 0.00141627 hartree
thermaltrasncorrection: 0.00141627 hartree
thermaltotal: -1668.85727018 hartree
thermalcorr: 0.02331504 hartree
nonthermalcorr: 0.30828152 hartree
totalcorr: 0.33159656 hartree
thermalcorrenthalpy: 0.00094421 hartree
totalenthalpy: -1668.85632597 hartree
totalentropycorr: -0.07559771 hartree
gibbsenthalpy: -1668.93192368 hartree
gibbsminuselec: 0.25694306 hartree
