program: Orca
programVersion: 5.0.2
elementType: Br O O N N N C C C C C C C C C C C C C C H H H H H H H H H H H H H H H H H H H H H H H
charge: 1
multiplicity: 1
keywords: wB97X-D3 TightOpt Freq def2-TZVPP def2/J RIJCOSX TightSCF defgrid3 CHELPG
frequency: 0.00 0.00 0.00 0.00 0.00 0.00 22.58 26.56 50.00 57.77 69.60 91.92 106.88 114.47 131.00 144.04 153.73 167.01 177.54 216.30 227.94 231.51 242.40 254.90 265.78 279.19 300.21 303.76 312.60 345.29 364.56 399.58 439.44 462.60 469.05 472.81 485.77 504.06 569.57 602.59 632.27 636.92 684.78 699.54 732.09 759.91 764.90 804.93 807.60 818.86 855.53 856.10 892.39 928.04 968.01 984.62 1024.87 1046.92 1057.37 1073.68 1078.11 1089.41 1094.34 1099.87 1108.71 1174.86 1180.83 1190.89 1201.89 1215.45 1220.28 1262.64 1289.72 1297.64 1307.20 1329.22 1340.05 1352.34 1359.29 1377.96 1389.16 1399.98 1420.68 1431.62 1442.01 1446.93 1469.38 1482.70 1490.80 1496.22 1501.82 1502.18 1507.15 1507.80 1509.22 1517.43 1517.49 1526.73 1563.85 1574.55 1582.09 1600.56 1618.00 1655.03 1665.89 1699.17 2695.96 3058.54 3064.43 3075.43 3079.81 3095.84 3110.66 3113.04 3138.30 3140.43 3148.32 3149.24 3160.16 3162.35 3164.54 3167.42 3169.70 3183.81 3239.51 3242.42 3614.86 3652.78 3780.46
frequency: 22.58 26.56 50.00 57.77 69.60 91.92 106.88 114.47 131.00 144.04 153.73 167.01 177.54 216.30 227.94 231.51 242.40 254.90 265.78 279.19 300.21 303.76 312.60 345.29 364.56 399.58 439.44 462.60 469.05 472.81 485.77 504.06 569.57 602.59 632.27 636.92 684.78 699.54 732.09 759.91 764.90 804.93 807.60 818.86 855.53 856.10 892.39 928.04 968.01 984.62 1024.87 1046.92 1057.37 1073.68 1078.11 1089.41 1094.34 1099.87 1108.71 1174.86 1180.83 1190.89 1201.89 1215.45 1220.28 1262.64 1289.72 1297.64 1307.20 1329.22 1340.05 1352.34 1359.29 1377.96 1389.16 1399.98 1420.68 1431.62 1442.01 1446.93 1469.38 1482.70 1490.80 1496.22 1501.82 1502.18 1507.15 1507.80 1509.22 1517.43 1517.49 1526.73 1563.85 1574.55 1582.09 1600.56 1618.00 1655.03 1665.89 1699.17 2695.96 3058.54 3064.43 3075.43 3079.81 3095.84 3110.66 3113.04 3138.30 3140.43 3148.32 3149.24 3160.16 3162.35 3164.54 3167.42 3169.70 3183.81 3239.51 3242.42 3614.86 3652.78 3780.46
formula: C14H23BrN3O2
InChI: InChI=1S/C14H23BrN3O2/c1-4-18(5-2)7-6-17-14(19)10-8-11(15)12(16)9-13(10)20-3/h8-9,17-18H,4-7,16H2,1-3H3
43 atoms
Br 3.621014 -2.244631 -0.173732
O  0.779082 3.057544 0.150437
O  -1.307605 -0.469631 -0.559126
N  -3.818405 -0.417302 0.128866
N  -1.512573 1.741217 -0.21639
N  4.847925 0.555823 0.289735
C  -3.869086 1.065478 0.316252
C  -4.002369 -1.156467 1.412742
C  -4.693508 -0.88705 -0.990507
C  -2.903632 1.790281 -0.617591
C  -3.794801 -2.649078 1.261095
C  -6.174739 -0.899085 -0.671941
C  -0.762237 0.62439 -0.320981
C  0.693962 0.707896 -0.138987
C  1.447691 1.880902 0.080721
C  1.39191 -0.500588 -0.206982
C  2.819618 1.815071 0.21856
C  3.508095 0.594553 0.147992
C  2.751544 -0.572906 -0.069095
C  1.50331 4.263177 0.345216
H  -3.611458 1.283496 1.35116
H  -4.889768 1.40236 0.143413
H  -3.010863 1.412985 -1.638942
H  -3.194349 2.83888 -0.640023
H  -3.261257 -0.743469 2.096586
H  -4.989724 -0.916077 1.80736
H  -4.479986 -0.236131 -1.837456
H  -4.343154 -1.880501 -1.264002
H  -1.014988 2.60478 -0.067443
H  -3.801951 -3.106493 2.248976
H  -2.830333 -2.866606 0.800505
H  -4.579784 -3.125464 0.675427
H  -6.718662 -1.182201 -1.571642
H  -6.548209 0.077338 -0.363601
H  -6.425937 -1.623878 0.101123
H  0.820237 -1.401051 -0.38064
H  3.396261 2.712429 0.386202
H  5.377477 1.394928 0.420282
H  5.341038 -0.314758 0.219398
H  2.031149 4.250885 1.299944
H  0.76393 5.058627 0.352788
H  2.206807 4.43095 -0.471554
H  -2.815647 -0.58719 -0.184649
totalener: -3436.17178482 hartree
nucrepener: 2007.98145588 hartree
electener: -5444.15324070 hartree
oneelecener: -8726.30647184 hartree
twoeener: 3282.15323114 hartree
kineticenergy: 3427.98160120 hartree
xcener: -154.008394713209 hartree
chargesum: 1.0000000
charge: -0.019307 -0.319085 -0.489538 0.115889 -0.203833 -0.228926 -0.111038 -0.128009 -0.136397 -0.118516 -0.238946 -0.231650 0.451950 -0.148854 0.216470 -0.026957 -0.125996 0.166315 -0.144340 -0.139282 0.118100 0.129632 0.133093 0.114341 0.120224 0.129343 0.127518 0.131861 0.175888 0.115458 0.108989 0.089579 0.118785 0.091828 0.093478 0.133596 0.091480 0.149231 0.168978 0.119017 0.108726 0.120805 0.170100
charge: 0.387346 0.301099 0.118638 0.432014 0.333041 0.377370 0.004494 -0.020998 -0.013495 -0.046166 0.022195 0.020084 -0.334256 -0.103456 -0.179773 0.006688 -0.023833 -0.161835 -0.360513 -0.034697 0.033360 0.031145 0.027246 0.037149 0.031446 0.028761 0.029392 0.032827 -0.059418 0.031196 0.025092 0.015908 0.032951 0.014886 0.017895 0.035594 0.017016 -0.025171 -0.041595 0.011622 0.014816 0.012348 -0.078414
qa: -0.0193 -0.3191 -0.4895 0.1159 -0.2038 -0.2289 -0.1110 -0.1280 -0.1364 -0.1185 -0.2389 -0.2316 0.4519 -0.1489 0.2165 -0.0270 -0.1260 0.1663 -0.1443 -0.1393 0.1181 0.1296 0.1331 0.1143 0.1202 0.1293 0.1275 0.1319 0.1759 0.1155 0.1090 0.0896 0.1188 0.0918 0.0935 0.1336 0.0915 0.1492 0.1690 0.1190 0.1087 0.1208 0.1701
va: 1.2533 2.0857 2.0308 3.4825 3.1730 3.3035 3.8132 3.8631 3.8858 3.9683 3.9334 3.9153 4.0264 3.7182 4.0497 3.8998 3.8738 3.9809 4.1308 3.8784 1.0122 1.0090 1.0012 1.0063 0.9996 0.9880 0.9997 0.9889 1.0589 1.0086 1.0071 1.0045 1.0089 1.0078 1.0042 1.0230 1.0315 1.0301 1.0405 0.9849 1.0007 0.9855 1.1201
dispcorr: -0.020436325 hartree
energy: -3436.194819494850
dipole: -80.26174 76.15549 -4.10626 30.82638 -28.71316 2.11322 5.05009 -4.48475 0.56533
magnitude: 4.65259 au
magnitude: 11.82596 debye
temp: 298.15 k
press: 1.00 atm
zeropoint: 0.37268425 hartree
thermalvibcorrection: 0.01901501 hartree
thermalrotcorrection: 0.00141627 hartree
thermaltrasncorrection: 0.00141627 hartree
thermaltotal: -3435.80028769 hartree
thermalcorr: 0.02184755 hartree
nonthermalcorr: 0.37268425 hartree
totalcorr: 0.39453180 hartree
thermalcorrenthalpy: 0.00094421 hartree
totalenthalpy: -3435.79934348 hartree
totalentropycorr: -0.07144943 hartree
gibbsenthalpy: -3435.87079291 hartree
gibbsminuselec: 0.32402659 hartree
