program: Orca
programVersion: 5.0.2
elementType: Br O O N N N C C C C C C C C C C C C C C H H H H H H H H H H H H H H H H H H H H H H H
charge: 1
multiplicity: 1
keywords: wB97X-D3 TightOpt Freq def2-TZVPP def2/J RIJCOSX TightSCF defgrid3 CHELPG
frequency: 0.00 0.00 0.00 0.00 0.00 0.00 12.25 26.24 38.62 52.80 65.05 90.43 97.64 105.58 117.80 136.84 155.43 179.96 204.05 215.28 222.57 245.19 264.39 265.61 269.97 287.95 288.55 316.51 338.88 340.56 361.98 383.81 410.68 439.37 454.03 472.11 491.57 508.36 565.57 589.22 633.97 681.32 688.56 730.25 757.11 760.66 774.04 778.06 810.11 826.32 850.68 854.80 857.77 891.95 937.36 947.71 956.46 1023.78 1050.47 1075.22 1079.46 1089.78 1092.60 1103.96 1109.18 1130.42 1171.61 1181.24 1183.45 1209.97 1216.91 1246.15 1264.97 1268.56 1295.34 1309.23 1323.13 1339.85 1359.40 1361.45 1377.27 1394.73 1399.59 1410.15 1421.26 1428.03 1450.69 1458.06 1462.85 1492.24 1496.57 1500.15 1501.49 1501.99 1505.68 1509.21 1509.77 1514.58 1522.86 1530.29 1554.20 1573.20 1618.84 1664.42 1681.19 1742.63 2990.67 3004.97 3052.70 3057.42 3061.47 3069.93 3100.00 3102.68 3110.84 3126.85 3132.92 3137.66 3147.68 3150.11 3156.12 3158.47 3198.94 3223.14 3242.88 3437.30 3513.85 3643.78 3769.57
frequency: 12.25 26.24 38.62 52.80 65.05 90.43 97.64 105.58 117.80 136.84 155.43 179.96 204.05 215.28 222.57 245.19 264.39 265.61 269.97 287.95 288.55 316.51 338.88 340.56 361.98 383.81 410.68 439.37 454.03 472.11 491.57 508.36 565.57 589.22 633.97 681.32 688.56 730.25 757.11 760.66 774.04 778.06 810.11 826.32 850.68 854.80 857.77 891.95 937.36 947.71 956.46 1023.78 1050.47 1075.22 1079.46 1089.78 1092.60 1103.96 1109.18 1130.42 1171.61 1181.24 1183.45 1209.97 1216.91 1246.15 1264.97 1268.56 1295.34 1309.23 1323.13 1339.85 1359.40 1361.45 1377.27 1394.73 1399.59 1410.15 1421.26 1428.03 1450.69 1458.06 1462.85 1492.24 1496.57 1500.15 1501.49 1501.99 1505.68 1509.21 1509.77 1514.58 1522.86 1530.29 1554.20 1573.20 1618.84 1664.42 1681.19 1742.63 2990.67 3004.97 3052.70 3057.42 3061.47 3069.93 3100.00 3102.68 3110.84 3126.85 3132.92 3137.66 3147.68 3150.11 3156.12 3158.47 3198.94 3223.14 3242.88 3437.30 3513.85 3643.78 3769.57
formula: C14H23BrN3O2
InChI: InChI=1S/C14H23BrN3O2/c1-4-18(5-2)7-6-17-14(19)10-8-11(15)12(16)9-13(10)20-3/h8-9,17,19H,4-7,16H2,1-3H3
43 atoms
Br 1.91442 -2.835385 -0.194126
O  1.988019 3.174352 0.081433
O  -0.549839 3.168478 0.001882
N  -3.571099 -0.555304 0.112651
N  -1.637666 1.249095 -0.021643
N  4.369631 -0.964262 -0.035098
C  -3.926975 0.797001 0.538591
C  -3.66872 -1.524829 1.211597
C  -4.328686 -1.013379 -1.0566
C  -2.957274 1.856693 -0.012492
C  -2.544329 -1.398939 2.225203
C  -4.134554 -0.16212 -2.298966
C  -0.491842 1.864341 -0.020033
C  0.774221 1.155839 -0.035984
C  2.020327 1.822153 0.023339
C  0.800784 -0.24435 -0.104493
C  3.201327 1.114852 0.023126
C  3.211654 -0.287837 -0.0382
C  1.966122 -0.955068 -0.104898
C  3.202172 3.921897 0.148144
H  -3.889091 0.841357 1.62621
H  -4.948744 1.062339 0.248804
H  -3.216176 2.160803 -1.026628
H  -2.956824 2.745165 0.615645
H  -4.643268 -1.446725 1.713215
H  -3.629803 -2.519844 0.767872
H  -3.996487 -2.029803 -1.27061
H  -5.400606 -1.073794 -0.81637
H  -1.718878 0.233443 -0.062073
H  -2.677526 -2.127181 3.024628
H  -2.506343 -0.412944 2.691206
H  -1.575725 -1.594369 1.76015
H  -4.623827 -0.639516 -3.14709
H  -3.076236 -0.052986 -2.544003
H  -4.574586 0.830361 -2.19805
H  -0.121191 -0.806356 -0.165949
H  4.147789 1.632234 0.070948
H  5.248936 -0.486521 0.010558
H  4.375345 -1.967006 -0.082297
H  3.757081 3.664748 1.050202
H  2.905056 4.964895 0.186779
H  3.806869 3.744991 -0.741139
H  0.358037 3.530263 0.027091
totalener: -3436.14585284 hartree
nucrepener: 2054.61510484 hartree
electener: -5490.76095768 hartree
oneelecener: -8817.65686944 hartree
twoeener: 3326.89591176 hartree
kineticenergy: 3427.96669415 hartree
xcener: -154.003550714640 hartree
chargesum: 1.0000000
charge: 0.010083 -0.292822 -0.263302 -0.235680 -0.129446 -0.207499 -0.146959 -0.063093 -0.067113 -0.070458 -0.244190 -0.251945 0.450837 -0.097971 0.216261 -0.053195 -0.135099 0.166877 -0.130713 -0.141020 0.120684 0.115281 0.131899 0.130198 0.098655 0.087319 0.084254 0.093009 0.158659 0.111461 0.081697 0.058056 0.114305 0.076476 0.080660 0.100904 0.101747 0.157546 0.175555 0.126675 0.123516 0.127188 0.230705
charge: 0.412322 0.335386 0.435242 0.183216 0.392013 0.393108 -0.061967 -0.088250 -0.092178 -0.018329 -0.000605 0.004507 -0.214720 -0.104293 -0.168661 0.000803 -0.012309 -0.151537 -0.353649 -0.011877 0.025610 0.027269 0.021753 0.029737 0.016423 0.023404 0.021344 0.016360 -0.038869 0.023442 0.006160 0.006540 0.024073 0.009866 0.008602 0.027842 0.022494 -0.017062 -0.034722 0.015046 0.021246 0.015055 -0.149834
qa: 0.0101 -0.2928 -0.2633 -0.2357 -0.1294 -0.2075 -0.1470 -0.0631 -0.0671 -0.0705 -0.2442 -0.2519 0.4508 -0.0980 0.2163 -0.0532 -0.1351 0.1669 -0.1307 -0.1410 0.1207 0.1153 0.1319 0.1302 0.0987 0.0873 0.0843 0.0930 0.1587 0.1115 0.0817 0.0581 0.1143 0.0765 0.0807 0.1009 0.1017 0.1575 0.1756 0.1267 0.1235 0.1272 0.2307
va: 1.2815 2.1307 2.2882 2.8806 3.3305 3.3429 3.9072 3.8781 3.8749 3.8121 3.9116 3.9104 3.9831 3.6952 4.1078 3.8882 3.9138 3.9650 4.2333 3.8518 0.9997 1.0091 1.0023 1.0146 1.0022 0.9999 1.0025 1.0018 1.0965 1.0151 1.0072 1.0071 1.0117 1.0060 1.0055 1.0285 1.0300 1.0256 1.0352 0.9839 0.9995 0.9838 1.0895
dispcorr: -0.020796161 hartree
energy: -3436.169345794803
dipole: -46.79910 47.55639 0.75729 37.29260 -35.17476 2.11783 3.63773 -3.44996 0.18776
magnitude: 2.25698 au
magnitude: 5.73678 debye
temp: 298.15 k
press: 1.00 atm
zeropoint: 0.37145536 hartree
thermalvibcorrection: 0.01909033 hartree
thermalrotcorrection: 0.00141627 hartree
thermaltrasncorrection: 0.00141627 hartree
thermaltotal: -3435.77596756 hartree
thermalcorr: 0.02192287 hartree
nonthermalcorr: 0.37145536 hartree
totalcorr: 0.39337823 hartree
thermalcorrenthalpy: 0.00094421 hartree
totalenthalpy: -3435.77502335 hartree
totalentropycorr: -0.07170067 hartree
gibbsenthalpy: -3435.84672402 hartree
gibbsminuselec: 0.32262177 hartree
