program: Orca
programVersion: 5.0.2
elementType: Br Br N N C C C C C C C C C C C C C C H H H H H H H H H H H H H H H H H H H H H
charge: 1
multiplicity: 1
keywords: wB97X-D3 TightOpt Freq def2-TZVPP def2/J RIJCOSX TightSCF defgrid3 CHELPG
frequency: 0.00 0.00 0.00 0.00 0.00 0.00 25.05 25.88 46.44 84.55 113.16 126.73 131.22 143.25 188.23 211.96 222.34 236.92 258.86 275.76 305.93 311.88 329.31 341.20 354.42 367.36 391.32 441.96 453.76 463.95 488.64 535.83 542.43 561.91 579.94 653.73 708.67 753.81 808.60 812.95 844.28 863.78 895.36 911.36 917.78 926.69 931.00 945.62 954.06 977.61 978.96 991.78 1044.02 1064.89 1075.07 1098.46 1118.28 1134.45 1140.46 1145.05 1172.29 1193.81 1208.57 1227.76 1236.09 1254.86 1275.06 1294.99 1302.97 1309.82 1315.04 1319.14 1356.57 1371.17 1383.88 1394.39 1398.62 1405.73 1407.53 1422.96 1458.61 1466.76 1486.31 1491.00 1496.70 1498.31 1499.12 1502.62 1506.62 1514.34 1518.96 1519.69 1546.11 1633.49 1662.58 1681.31 3041.31 3051.06 3055.68 3061.73 3063.87 3073.62 3093.20 3095.41 3116.02 3123.25 3123.39 3125.42 3127.05 3135.25 3158.61 3186.90 3214.23 3216.16 3238.81 3532.88 3601.94
frequency: 25.05 25.88 46.44 84.55 113.16 126.73 131.22 143.25 188.23 211.96 222.34 236.92 258.86 275.76 305.93 311.88 329.31 341.20 354.42 367.36 391.32 441.96 453.76 463.95 488.64 535.83 542.43 561.91 579.94 653.73 708.67 753.81 808.60 812.95 844.28 863.78 895.36 911.36 917.78 926.69 931.00 945.62 954.06 977.61 978.96 991.78 1044.02 1064.89 1075.07 1098.46 1118.28 1134.45 1140.46 1145.05 1172.29 1193.81 1208.57 1227.76 1236.09 1254.86 1275.06 1294.99 1302.97 1309.82 1315.04 1319.14 1356.57 1371.17 1383.88 1394.39 1398.62 1405.73 1407.53 1422.96 1458.61 1466.76 1486.31 1491.00 1496.70 1498.31 1499.12 1502.62 1506.62 1514.34 1518.96 1519.69 1546.11 1633.49 1662.58 1681.31 3041.31 3051.06 3055.68 3061.73 3063.87 3073.62 3093.20 3095.41 3116.02 3123.25 3123.39 3125.42 3127.05 3135.25 3158.61 3186.90 3214.23 3216.16 3238.81 3532.88 3601.94
formula: C14H21Br2N2
InChI: InChI=1S/C14H21Br2N2/c1-18(12-5-3-2-4-6-12)9-10-7-11(15)8-13(16)14(10)17/h7-8,12,18H,2-6,9,17H2,1H3
39 atoms
Br -1.848707 3.023372 -0.644214
Br -3.292304 -2.385418 -0.011353
N  2.433279 0.124821 1.47066
N  0.602577 2.160112 1.115089
C  3.059268 -0.639967 0.311589
C  2.054505 -1.372051 -0.568996
C  3.885574 0.337768 -0.522487
C  2.787326 -2.109284 -1.691715
C  4.61038 -0.386982 -1.655585
C  3.635623 -1.163257 -2.532091
C  1.193664 -0.458252 2.089581
C  3.437079 0.381361 2.535534
C  -0.060113 -0.170193 1.302343
C  -0.328216 1.117619 0.830102
C  -0.954626 -1.202285 1.064858
C  -1.472257 1.315573 0.057943
C  -2.096964 -0.974944 0.318032
C  -2.352984 0.280516 -0.206295
H  3.714192 -1.377521 0.785102
H  1.348119 -0.657868 -1.001152
H  1.474679 -2.091064 0.008349
H  4.613326 0.871866 0.089535
H  3.208055 1.088612 -0.944841
H  2.052271 -2.622275 -2.311898
H  3.423394 -2.887465 -1.2582
H  5.34998 -1.071786 -1.229496
H  5.167133 0.340943 -2.245723
H  4.178679 -1.721999 -3.294426
H  2.984187 -0.462668 -3.063667
H  1.123942 -0.023516 3.087527
H  1.345544 -1.528625 2.214147
H  3.632621 -0.547713 3.067112
H  3.042165 1.123567 3.225041
H  4.356884 0.752079 2.097026
H  -0.752058 -2.195532 1.44443
H  -3.234875 0.457209 -0.805412
H  0.469564 2.523129 2.052254
H  2.104448 1.047527 1.120975
H  0.479001 2.940146 0.481625
totalener: -5803.92502627 hartree
nucrepener: 2195.09717930 hartree
electener: -7999.02220557 hartree
twoeener: 4398.52041519 hartree
kineticenergy: 5792.95931089 hartree
xcener: -206.548394288660 hartree
chargesum: 1.0000000
charge: 0.023442 0.049649 0.140732 -0.341850 -0.025330 -0.166376 -0.196208 -0.170670 -0.147331 -0.127690 -0.157595 -0.183037 -0.029801 0.108376 -0.040601 -0.149389 -0.119308 0.009377 0.102728 0.101848 0.102439 0.104186 0.091779 0.099529 0.087137 0.085438 0.099627 0.099903 0.078544 0.156484 0.137537 0.134357 0.118413 0.140162 0.125403 0.141010 0.165075 0.182232 0.169781
charge: 0.424416 0.420270 0.446214 0.319974 -0.059966 -0.012674 -0.016098 -0.009974 -0.012410 -0.019346 0.023202 0.057750 -0.088186 -0.169250 -0.020160 -0.341720 -0.352658 -0.036398 0.040177 0.033224 0.024956 0.019585 0.029857 0.029459 0.027163 0.027359 0.029172 0.028525 0.025354 0.040118 0.042945 0.029900 0.023593 0.023404 0.032579 0.036617 -0.027467 -0.022840 -0.046663
qa: 0.0234 0.0496 0.1407 -0.3418 -0.0253 -0.1664 -0.1962 -0.1707 -0.1473 -0.1277 -0.1576 -0.1830 -0.0298 0.1084 -0.0406 -0.1494 -0.1193 0.0094 0.1027 0.1018 0.1024 0.1042 0.0918 0.0995 0.0871 0.0854 0.0996 0.0999 0.0785 0.1565 0.1375 0.1344 0.1184 0.1402 0.1254 0.1410 0.1651 0.1822 0.1698
va: 1.2966 1.2911 3.5399 3.0898 3.8089 3.8791 3.9131 3.9604 3.9218 3.8877 3.8311 3.8780 3.6379 3.6986 3.7957 4.1580 4.1805 3.7676 1.0113 1.0032 1.0197 1.0192 1.0163 1.0137 1.0115 1.0119 1.0142 1.0146 1.0135 0.9836 1.0016 0.9941 1.0000 1.0022 1.0119 0.9958 1.0054 1.0596 1.0466
dispcorr: -0.021922605 hartree
energy: -5803.949110684759
dipole: 95.06570 -90.81372 4.25198 -11.62957 11.94177 0.31220 9.39169 -7.43473 1.95696
magnitude: 4.69111 au
magnitude: 11.92385 debye
temp: 298.15 k
press: 1.00 atm
zeropoint: 0.34041850 hartree
thermalvibcorrection: 0.01511103 hartree
thermalrotcorrection: 0.00141627 hartree
thermaltrasncorrection: 0.00141627 hartree
thermaltotal: -5803.59074862 hartree
thermalcorr: 0.01794357 hartree
nonthermalcorr: 0.34041850 hartree
totalcorr: 0.35836207 hartree
thermalcorrenthalpy: 0.00094421 hartree
totalenthalpy: -5803.58980441 hartree
totalentropycorr: -0.06409625 hartree
gibbsenthalpy: -5803.65390066 hartree
gibbsminuselec: 0.29521002 hartree
