program: Orca
programVersion: 5.0.2
elementType: Br Br O N N C C C C C C C C C C C C H H H H H H H H H H H H H H H H H H H
charge: 1
multiplicity: 1
keywords: wB97X-D3 TightOpt Freq def2-TZVPP def2/J RIJCOSX TightSCF defgrid3 CHELPG
frequency: 0.00 0.00 0.00 0.00 0.00 0.00 12.47 19.64 31.01 81.96 86.53 120.89 140.84 145.27 149.74 202.30 210.32 224.55 258.88 269.62 279.79 286.87 295.97 306.35 318.50 339.33 343.64 345.38 374.49 427.02 430.09 451.32 458.68 488.48 520.80 535.12 555.70 627.18 692.91 765.85 770.42 775.35 819.52 836.86 899.42 913.59 936.19 952.01 953.32 955.90 965.61 980.62 1008.29 1037.48 1075.30 1079.21 1083.11 1103.07 1138.76 1195.65 1215.61 1230.82 1247.92 1270.63 1289.80 1326.51 1331.56 1359.78 1367.30 1382.79 1402.52 1418.76 1431.34 1431.63 1442.47 1463.42 1467.18 1482.02 1483.69 1490.39 1499.87 1514.50 1522.28 1525.29 1534.62 1620.59 1643.26 1655.26 1682.54 3059.22 3063.98 3066.29 3070.06 3131.06 3133.67 3146.08 3149.21 3162.27 3163.04 3168.30 3200.30 3201.24 3208.22 3408.16 3477.80 3639.79 3757.39 3900.23
frequency: 12.47 19.64 31.01 81.96 86.53 120.89 140.84 145.27 149.74 202.30 210.32 224.55 258.88 269.62 279.79 286.87 295.97 306.35 318.50 339.33 343.64 345.38 374.49 427.02 430.09 451.32 458.68 488.48 520.80 535.12 555.70 627.18 692.91 765.85 770.42 775.35 819.52 836.86 899.42 913.59 936.19 952.01 953.32 955.90 965.61 980.62 1008.29 1037.48 1075.30 1079.21 1083.11 1103.07 1138.76 1195.65 1215.61 1230.82 1247.92 1270.63 1289.80 1326.51 1331.56 1359.78 1367.30 1382.79 1402.52 1418.76 1431.34 1431.63 1442.47 1463.42 1467.18 1482.02 1483.69 1490.39 1499.87 1514.50 1522.28 1525.29 1534.62 1620.59 1643.26 1655.26 1682.54 3059.22 3063.98 3066.29 3070.06 3131.06 3133.67 3146.08 3149.21 3162.27 3163.04 3168.30 3200.30 3201.24 3208.22 3408.16 3477.80 3639.79 3757.39 3900.23
formula: C12H19Br2N2O
InChI: InChI=1S/C12H19Br2N2O/c1-12(2,3)16-6-10(17)7-4-8(13)11(15)9(14)5-7/h4-5,10,17H,6,15-16H2,1-3H3
36 atoms
Br 1.310855 3.162991 0.051282
Br 3.120073 -2.212109 -0.40153
O  -2.18694 0.000777 2.674853
N  -2.937555 -0.230303 0.099295
N  3.163463 0.8440 -0.797215
C  -3.894357 -0.385286 -1.077285
C  -2.531358 -1.429699 0.881715
C  -1.506578 -0.982705 1.923082
C  -4.119969 1.031501 -1.594568
C  -3.216814 -1.251917 -2.129823
C  -5.190944 -1.00197 -0.572808
C  -0.240001 -0.473062 1.2653
C  0.722653 -1.376218 0.827313
C  -0.036385 0.87898 1.021887
C  1.090322 1.312971 0.347618
C  1.84493 -0.941395 0.157206
C  2.074933 0.423374 -0.114569
H  -3.3314 0.432964 0.769834
H  -3.416501 -1.833901 1.366207
H  -2.105171 -2.164164 0.204039
H  -1.273884 -1.857441 2.538324
H  -4.790674 1.003271 -2.451216
H  -4.580677 1.668439 -0.836953
H  -3.186952 1.494643 -1.92213
H  -3.087965 -2.282215 -1.800334
H  -2.244121 -0.848964 -2.419639
H  -3.840302 -1.274242 -3.022009
H  -5.915353 -1.01014 -1.385585
H  -5.059127 -2.032475 -0.245024
H  -5.622972 -0.422713 0.245488
H  0.608328 -2.436611 1.018799
H  -0.743461 1.615425 1.383208
H  -1.648125 0.288983 3.413129
H  3.910563 0.199272 -0.977802
H  3.371435 1.824454 -0.838039
H  -2.078059 0.210804 -0.242232
totalener: -5801.74496759 hartree
nucrepener: 2063.77487576 hartree
electener: -7865.51984336 hartree
twoeener: 4271.02009800 hartree
kineticenergy: 5790.93972926 hartree
xcener: -204.694273607540 hartree
chargesum: 1.0000000
charge: -0.001694 0.005779 -0.338440 0.112480 -0.242958 0.008328 -0.151645 0.151769 -0.241075 -0.266579 -0.265322 -0.025526 -0.131450 -0.238319 -0.107617 -0.119606 0.211065 0.177001 0.148050 0.145038 0.143049 0.116859 0.110149 0.112206 0.106989 0.118007 0.122783 0.120040 0.110382 0.117332 0.123539 0.150960 0.199360 0.168739 0.168070 0.182259
charge: 0.402667 0.412215 0.301599 0.541297 0.363098 -0.188245 0.023736 -0.170621 0.034706 0.036122 0.036270 -0.124846 -0.032753 -0.061550 -0.350521 -0.341699 -0.199579 0.045590 0.035907 0.035811 0.039495 0.037766 0.024622 0.024841 0.021062 0.025985 0.039207 0.039110 0.022298 0.026263 0.032124 0.021989 -0.112330 -0.042995 -0.042594 0.043953
qa: -0.0017 0.0058 -0.3384 0.1125 -0.2430 0.0083 -0.1516 0.1518 -0.2411 -0.2666 -0.2653 -0.0255 -0.1315 -0.2383 -0.1076 -0.1196 0.2111 0.1770 0.1481 0.1450 0.1430 0.1169 0.1101 0.1122 0.1070 0.1180 0.1228 0.1200 0.1104 0.1173 0.1235 0.1510 0.1994 0.1687 0.1681 0.1823
va: 1.2727 1.2752 2.0928 3.6204 3.2720 4.0150 3.8505 3.9469 3.8938 3.9043 3.9085 3.5822 3.9740 3.8560 4.1605 4.1508 3.7682 1.0231 1.0122 0.9983 0.9826 1.0085 1.0064 1.0055 1.0072 1.0035 1.0074 1.0083 1.0029 1.0026 1.0165 1.0308 1.0391 1.0397 1.0383 1.0124
dispcorr: -0.018746236 hartree
energy: -5801.765887459105
dipole: -83.23334 78.82416 -4.40918 -15.73884 14.91927 -0.81957 -1.57098 1.48899 -0.08199
magnitude: 4.48545 au
magnitude: 11.40112 debye
temp: 298.15 k
press: 1.00 atm
zeropoint: 0.30554287 hartree
thermalvibcorrection: 0.01635468 hartree
thermalrotcorrection: 0.00141627 hartree
thermaltrasncorrection: 0.00141627 hartree
thermaltotal: -5801.44115736 hartree
thermalcorr: 0.01918723 hartree
nonthermalcorr: 0.30554287 hartree
totalcorr: 0.32473010 hartree
thermalcorrenthalpy: 0.00094421 hartree
totalenthalpy: -5801.44021315 hartree
totalentropycorr: -0.06674520 hartree
gibbsenthalpy: -5801.50695835 hartree
gibbsminuselec: 0.25892911 hartree
