program: Orca
programVersion: 5.0.2
elementType: C C C C C C H H H H H C H H N C H O C H H C H H Cl H
charge: 1
multiplicity: 1
keywords: wB97X-D3 TightOpt Freq def2-TZVPP def2/J RIJCOSX TightSCF defgrid3 CHELPG
frequency: 0.00 0.00 0.00 0.00 0.00 0.00 14.76 26.25 57.61 58.78 127.49 153.51 213.27 238.01 296.79 333.62 343.18 417.95 448.00 523.98 571.28 603.55 638.45 688.74 704.16 723.72 729.78 775.28 791.70 828.53 883.46 901.58 939.65 963.98 966.39 1009.27 1027.27 1031.83 1045.16 1055.44 1066.62 1070.55 1125.39 1193.14 1199.70 1215.91 1248.08 1257.28 1261.23 1285.64 1344.93 1350.75 1355.50 1374.48 1387.32 1425.05 1465.09 1497.90 1502.63 1510.88 1554.71 1578.99 1672.04 1689.07 1749.84 3078.23 3098.60 3124.20 3139.87 3150.71 3191.03 3191.37 3192.82 3213.74 3224.35 3233.70 3514.13 3627.83
frequency: 14.76 26.25 57.61 58.78 127.49 153.51 213.27 238.01 296.79 333.62 343.18 417.95 448.00 523.98 571.28 603.55 638.45 688.74 704.16 723.72 729.78 775.28 791.70 828.53 883.46 901.58 939.65 963.98 966.39 1009.27 1027.27 1031.83 1045.16 1055.44 1066.62 1070.55 1125.39 1193.14 1199.70 1215.91 1248.08 1257.28 1261.23 1285.64 1344.93 1350.75 1355.50 1374.48 1387.32 1425.05 1465.09 1497.90 1502.63 1510.88 1554.71 1578.99 1672.04 1689.07 1749.84 3078.23 3098.60 3124.20 3139.87 3150.71 3191.03 3191.37 3192.82 3213.74 3224.35 3233.70 3514.13 3627.83
formula: C10H13ClNO
InChI: InChI=1S/C10H13ClNO/c11-7-6-10(13)12-8-9-4-2-1-3-5-9/h1-5,12-13H,6-8H2
26 atoms
C  -4.099219 1.194735 -0.590815
C  -2.824147 0.796494 -0.959951
C  -2.244087 -0.32228 -0.37129
C  -2.951995 -1.041608 0.585955
C  -4.226906 -0.642466 0.954327
C  -4.79918 0.476386 0.367268
H  -4.550089 2.060249 -1.057864
H  -2.285784 1.350717 -1.720641
H  -2.513573 -1.925724 1.035127
H  -4.777254 -1.210204 1.692763
H  -5.797191 0.783919 0.65045
C  -0.846597 -0.730006 -0.739246
H  -0.69608 -1.804345 -0.635673
H  -0.597955 -0.451217 -1.762912
N  0.115612 -0.050526 0.159641
C  1.39985 -0.196697 0.119121
H  -0.277945 0.560988 0.859945
O  1.866905 -0.988053 -0.792755
C  2.298876 0.488319 1.104148
H  1.728571 1.253594 1.631518
H  2.597617 -0.259283 1.844416
C  3.53978 1.1318 0.495081
H  3.295958 1.819788 -0.311071
H  4.084473 1.669373 1.265257
Cl 4.662504 -0.089938 -0.171149
H  2.845391 -1.012427 -0.780956
totalener: -978.90892727 hartree
nucrepener: 826.13470361 hartree
electener: -1805.04363088 hartree
oneelecener: -2961.52188893 hartree
twoeener: 1156.47825805 hartree
kineticenergy: 975.48518580 hartree
xcener: -72.070269538204 hartree
chargesum: 1.0000000
charge: -0.121258 -0.139137 -0.077229 -0.139000 -0.120992 -0.098123 0.148378 0.128290 0.129081 0.148599 0.150814 -0.007731 0.144592 0.144208 -0.109705 0.402483 0.188173 -0.222103 -0.151505 0.097659 0.144674 -0.095661 0.139473 0.149671 -0.064406 0.230753
charge: 0.008517 -0.002388 -0.112939 -0.001979 0.008768 0.015694 0.030555 0.026605 0.026923 0.030670 0.031792 0.005759 0.040886 0.040627 0.411054 -0.209994 0.020012 0.460629 -0.025496 0.049128 0.057574 -0.236791 0.016323 0.022050 0.418555 -0.132534
qa: -0.1213 -0.1391 -0.0772 -0.1390 -0.1210 -0.0981 0.1484 0.1283 0.1291 0.1486 0.1508 -0.0077 0.1446 0.1442 -0.1097 0.4025 0.1882 -0.2221 -0.1515 0.0977 0.1447 -0.0957 0.1395 0.1497 -0.0644 0.2308
va: 3.9871 3.9772 3.6354 3.9770 3.9863 3.9602 0.9971 1.0079 1.0076 0.9971 0.9948 3.7679 1.0032 1.0035 3.4511 3.9279 1.0044 2.3352 3.9711 1.0218 0.9999 3.9655 0.9953 0.9930 1.2651 1.0931
dispcorr: -0.009127238 hartree
energy: -978.919987949241
dipole: -13.43307 14.58112 1.14805 2.92891 -2.28411 0.64480 2.88193 -2.05632 0.82560
magnitude: 1.55415 au
magnitude: 3.95035 debye
temp: 298.15 k
press: 1.00 atm
zeropoint: 0.21983340 hartree
thermalvibcorrection: 0.00954807 hartree
thermalrotcorrection: 0.00141627 hartree
thermaltrasncorrection: 0.00141627 hartree
thermaltotal: -978.68777393 hartree
thermalcorr: 0.01238062 hartree
nonthermalcorr: 0.21983340 hartree
totalcorr: 0.23221402 hartree
thermalcorrenthalpy: 0.00094421 hartree
totalenthalpy: -978.68682972 hartree
totalentropycorr: -0.05240368 hartree
gibbsenthalpy: -978.73923340 hartree
gibbsminuselec: 0.18075455 hartree
