program: Orca
programVersion: 5.0.2
elementType: C C C S H H N N H H H
charge: 1
multiplicity: 1
keywords: wB97X-D3 TightOpt Freq def2-TZVPP def2/J RIJCOSX TightSCF defgrid3 CHELPG
frequency: 0.00 0.00 0.00 0.00 0.00 0.00 132.66 245.22 328.68 492.98 574.75 621.05 691.92 784.35 794.00 902.24 962.38 1024.27 1096.89 1109.54 1224.07 1261.69 1377.22 1481.35 1517.33 1601.09 1649.19 1658.84 3264.84 3284.38 3414.33 3491.92 3507.02
frequency: 132.66 245.22 328.68 492.98 574.75 621.05 691.92 784.35 794.00 902.24 962.38 1024.27 1096.89 1109.54 1224.07 1261.69 1377.22 1481.35 1517.33 1601.09 1649.19 1658.84 3264.84 3284.38 3414.33 3491.92 3507.02
formula: C3H5N2S
InChI: InChI=1S/C3H5N2S/c4-3-5-1-2-6-3/h1-2H,4H3
11 atoms
C  0.683033 0.152603 -0.000006
C  -1.203103 1.204897 -0.000271
C  -1.666166 -0.072449 0.000133
S  -0.368854 -1.183292 0.000358
H  -1.814651 2.09384 -0.000512
H  -2.686726 -0.420971 0.000262
N  0.159508 1.322278 -0.000344
N  2.14883 0.061394 0.000032
H  2.491351 1.027568 -0.001052
H  2.516092 -0.408924 0.82984
H  2.516059 -0.410821 -0.828709
totalener: -624.77960601 hartree
nucrepener: 287.85687214 hartree
electener: -912.63647815 hartree
oneelecener: -1416.37888982 hartree
twoeener: 503.74241166 hartree
kineticenergy: 622.90970572 hartree
xcener: -40.914543651732 hartree
energy: -2426.6331 -401.8918 -397.7130 -287.6737 -285.2905 -285.1662 -225.1271 -169.4349 -169.3029 -169.2753 -36.8915 -34.5514 -30.2058 -28.3573 -25.1147 -24.6786 -24.6669 -23.1910 -21.7812 -19.9454 -19.2436 -18.7985 -17.4017 -15.5216 -15.2215 -14.1323 -3.7530 -2.9213 -2.1312 -1.4982 -0.9787 -0.8383 -0.1480 0.5884 0.9460 1.5913 1.7664 2.4347 2.7602 3.5219 3.7071 4.2629 4.5476 4.9601 5.0722 5.5896 5.9679 6.1479 6.9822 7.1932 7.4093 8.1351 8.1484 8.3577 8.6671 9.1341 9.3363 9.5294 9.7795 10.2001 10.4197 11.2120 11.5777 12.5413 12.9129 13.8346 14.1639 14.7167 14.9995 15.7303 16.1238 16.5417 17.9804 18.0857 18.6400 20.1741 20.9081 21.2994 21.8305 22.2150 23.1593 23.4497 23.7512 24.6357 26.0181 26.2806 26.3954 27.0724 27.6665 27.8227 28.9749 29.0395 29.5161 29.9450 30.1639 30.8412 31.8893 32.3362 32.9282 34.6400 35.6111 35.9794 36.6227 36.7555 37.8035 38.0524 38.1263 38.4433 38.8523 38.8857 39.1677 39.5739 40.0624 40.2428 40.7283 42.0333 43.0304 43.5089 44.2175 44.5570 44.6125 44.9129 46.8646 47.4616 47.9992 48.6950 49.1192 50.8379 51.5687 52.4429 53.9179 55.0887 56.6144 57.2258 57.9785 59.5278 59.6330 61.0476 61.8822 63.3951 63.7343 64.6603 66.5993 67.3531 68.2896 69.8538 70.3051 71.2592 72.0285 73.3370 74.3974 75.5042 76.0053 76.6776 76.7087 77.6913 77.7375 79.6459 80.1594 80.1720 80.6415 81.0778 81.6267 81.9635 82.4993 82.7403 84.1313 84.3352 84.6715 84.8865 85.4568 85.8111 86.3101 86.8878 87.4054 87.8766 88.6327 89.3627 89.8260 90.6346 91.6442 92.1666 92.5574 93.3083 94.3731 95.1861 96.5015 97.8615 98.3005 99.0253 99.0494 99.3148 100.2391 100.4875 100.8472 102.4061 102.5572 103.5125 104.2215 105.0953 107.4095 107.6495 108.5191 108.5250 109.5114 110.1795 110.4879 111.8625 112.2418 113.4880 115.3961 115.5523 116.1505 117.0053 118.6472 120.0623 124.0429 124.9057 125.5369 125.5520 127.6716 127.6969 130.1046 130.2243 131.0461 131.1332 132.9793 135.0244 136.0827 136.5087 137.4826 137.5837 139.0777 139.4929 141.6852 142.0698 143.4939 145.5893 147.2402 148.3086 150.3909 152.3057 153.5275 153.9280 156.1304 156.5446 158.5477 160.2840 161.4148 167.7634 171.2024 172.1185 174.7543 180.8515 181.6425 184.0665 188.8941 200.8507 239.1918 254.1912 256.6793 557.4211 613.1744 620.4928 634.2807 878.3037 890.7579 electronvolt
chargesum: 1.0000000
charge: 0.121311 -0.029808 -0.077990 0.160725 0.166561 0.168149 -0.272279 0.098564 0.224913 0.219940 0.219915
charge: -0.511097 -0.111069 -0.223122 0.815822 0.032050 0.015372 0.161950 0.601160 0.081311 0.068816 0.068807
qa: 0.1213 -0.0298 -0.0780 0.1607 0.1666 0.1681 -0.2723 0.0986 0.2249 0.2199 0.2199
va: 3.9755 4.0420 3.9353 2.8128 0.9988 0.9926 3.0461 3.6956 0.9966 0.9776 0.9776
dispcorr: -0.002028792 hartree
energy: -624.783156012061
dipole: 2.98365 -0.60242 2.38123 1.86288 -2.25559 -0.39271 -0.00041 0.00056 0.00015
magnitude: 2.41340 au
magnitude: 6.13437 debye
temp: 298.15 k
press: 1.00 atm
zeropoint: 0.08769623 hartree
thermalvibcorrection: 0.00261815 hartree
thermalrotcorrection: 0.00141627 hartree
thermaltrasncorrection: 0.00141627 hartree
thermaltotal: -624.69000909 hartree
thermalcorr: 0.00545069 hartree
nonthermalcorr: 0.08769623 hartree
totalcorr: 0.09314692 hartree
thermalcorrenthalpy: 0.00094421 hartree
totalenthalpy: -624.68906488 hartree
totalentropycorr: -0.03571199 hartree
gibbsenthalpy: -624.72477687 hartree
gibbsminuselec: 0.05837915 hartree
