program: Orca
programVersion: 5.0.2
elementType: C C C C C C C H H H S C H H C H H C H H H N N N C O O C H H H H H H
charge: 1
multiplicity: 1
keywords: wB97X-D3 TightOpt Freq def2-TZVPP def2/J RIJCOSX TightSCF defgrid3 CHELPG
frequency: 0.00 0.00 0.00 0.00 0.00 0.00 28.75 44.15 51.19 77.01 79.33 102.29 108.53 121.09 127.99 168.12 202.87 214.24 239.84 244.52 276.44 294.65 328.85 361.89 368.83 390.84 432.14 444.07 467.98 500.77 548.77 610.74 622.13 722.71 732.81 736.15 741.75 763.07 768.36 787.02 793.64 796.61 844.25 876.91 879.79 891.06 923.96 950.25 985.02 1001.12 1055.74 1067.82 1078.24 1100.66 1122.12 1128.55 1174.53 1186.16 1221.14 1224.72 1244.27 1254.43 1272.51 1281.97 1298.88 1334.96 1337.46 1349.49 1389.53 1399.28 1428.85 1464.99 1490.48 1493.03 1495.34 1499.97 1500.19 1506.19 1513.59 1514.44 1545.91 1623.91 1682.10 1703.17 1722.08 1853.56 3055.98 3059.90 3070.02 3096.95 3100.34 3118.85 3136.07 3149.01 3190.83 3214.86 3222.14 3234.24 3246.25 3587.58 3665.55 3691.55
frequency: 28.75 44.15 51.19 77.01 79.33 102.29 108.53 121.09 127.99 168.12 202.87 214.24 239.84 244.52 276.44 294.65 328.85 361.89 368.83 390.84 432.14 444.07 467.98 500.77 548.77 610.74 622.13 722.71 732.81 736.15 741.75 763.07 768.36 787.02 793.64 796.61 844.25 876.91 879.79 891.06 923.96 950.25 985.02 1001.12 1055.74 1067.82 1078.24 1100.66 1122.12 1128.55 1174.53 1186.16 1221.14 1224.72 1244.27 1254.43 1272.51 1281.97 1298.88 1334.96 1337.46 1349.49 1389.53 1399.28 1428.85 1464.99 1490.48 1493.03 1495.34 1499.97 1500.19 1506.19 1513.59 1514.44 1545.91 1623.91 1682.10 1703.17 1722.08 1853.56 3055.98 3059.90 3070.02 3096.95 3100.34 3118.85 3136.07 3149.01 3190.83 3214.86 3222.14 3234.24 3246.25 3587.58 3665.55 3691.55
formula: C12H16N3O2S
InChI: InChI=1S/C12H16N3O2S/c1-3-6-18-8-4-5-9-10(7-8)14-11(13-9)15-12(16)17-2/h4-5,7,13-15H,3,6H2,1-2H3
34 atoms
C  -0.435405 1.924308 -0.001076
C  -0.135252 0.573008 0.000621
C  1.165364 0.095967 0.002048
C  2.179747 1.045592 0.001918
C  1.862161 2.422836 0.000249
C  0.56629 2.883667 -0.001283
C  -2.346002 0.787531 -0.001033
H  1.367481 -0.964652 0.003345
H  2.673284 3.139583 0.000085
H  0.351418 3.943383 -0.002591
S  3.884935 0.668379 0.004189
C  3.938038 -1.133627 0.000257
H  3.4295 -1.50857 -0.890428
H  3.426522 -1.512813 0.887429
C  5.395643 -1.584062 0.001749
H  5.902799 -1.16935 -0.872118
H  5.899342 -1.174623 0.880086
C  5.509751 -3.102905 -0.002668
H  6.554318 -3.411489 -0.001304
H  5.034639 -3.539271 0.877661
H  5.03857 -3.533806 -0.887789
N  -1.834322 2.018992 -0.002191
N  -1.359106 -0.101668 0.000636
N  -3.668373 0.496631 -0.001408
C  -4.155354 -0.816901 0.000397
O  -3.435842 -1.77971 0.002295
O  -5.464388 -0.791244 -0.00048
C  -6.125812 -2.075806 0.001302
H  -5.846684 -2.633086 -0.889465
H  -5.84792 -2.629962 0.894402
H  -7.185545 -1.848395 0.000171
H  -1.551139 -1.095495 0.001777
H  -2.368334 2.870487 -0.003472
H  -4.343026 1.243823 -0.002826
totalener: -1179.72715454 hartree
nucrepener: 1365.98667870 hartree
electener: -2545.71383324 hartree
oneelecener: -4305.84996564 hartree
twoeener: 1760.13613240 hartree
kineticenergy: 1175.02477777 hartree
xcener: -94.129463955058 hartree
chargesum: 1.0000000
charge: 0.062761 0.031045 -0.121906 0.057572 -0.048352 -0.133829 0.410587 0.120180 0.128994 0.140115 0.012428 -0.130800 0.095363 0.094973 -0.117171 0.085497 0.085505 -0.250034 0.102056 0.077968 0.078015 -0.131486 -0.130929 -0.182242 0.497668 -0.385743 -0.274240 -0.114354 0.130532 0.130534 0.139957 0.203352 0.165421 0.170559
charge: -0.119671 -0.112533 -0.017512 -0.309839 -0.006584 0.010378 -0.203623 0.022369 0.033425 0.033094 0.681862 -0.231946 0.003809 0.003717 -0.069965 0.021709 0.021711 0.007108 0.018675 0.012593 0.012605 0.414919 0.428765 0.351958 -0.532212 0.128030 0.308806 0.018377 0.017090 0.017092 0.019798 -0.006087 0.010750 0.011332
qa: 0.0628 0.0310 -0.1219 0.0576 -0.0484 -0.1338 0.4106 0.1202 0.1290 0.1401 0.0124 -0.1308 0.0954 0.0950 -0.1172 0.0855 0.0855 -0.2500 0.1021 0.0780 0.0780 -0.1315 -0.1309 -0.1822 0.4977 -0.3857 -0.2742 -0.1144 0.1305 0.1305 0.1400 0.2034 0.1654 0.1706
va: 3.8388 4.0455 4.0341 4.0792 3.9362 4.0783 4.0688 1.0203 1.0107 1.0055 2.4652 3.9846 0.9991 0.9990 3.8952 1.0100 1.0100 3.9486 1.0075 1.0028 1.0028 3.4860 3.4923 3.2848 4.2672 2.1140 2.1597 3.8270 0.9929 0.9929 0.9922 1.0328 1.0203 1.0287
dispcorr: -0.011953386 hartree
energy: -1179.742061540585
dipole: 12.16731 -15.83355 -3.66624 -13.71441 14.54821 0.83380 -0.01310 0.00908 -0.00403
magnitude: 3.75986 au
magnitude: 9.55681 debye
temp: 298.15 k
press: 1.00 atm
zeropoint: 0.28033511 hartree
thermalvibcorrection: 0.01505090 hartree
thermalrotcorrection: 0.00141627 hartree
thermaltrasncorrection: 0.00141627 hartree
thermaltotal: -1179.44384299 hartree
thermalcorr: 0.01788344 hartree
nonthermalcorr: 0.28033511 hartree
totalcorr: 0.29821855 hartree
thermalcorrenthalpy: 0.00094421 hartree
totalenthalpy: -1179.44289878 hartree
totalentropycorr: -0.06346932 hartree
gibbsenthalpy: -1179.50636810 hartree
gibbsminuselec: 0.23569344 hartree
