program: Orca
programVersion: 5.0.2
elementType: C C C C C C O N C C O H H H H H H H H H H
charge: 1
multiplicity: 1
keywords: wB97X-D3 TightOpt Freq def2-TZVPP def2/J RIJCOSX TightSCF defgrid3 CHELPG
frequency: 0.00 0.00 0.00 0.00 0.00 0.00 32.68 74.80 91.71 109.30 198.43 351.99 368.99 378.86 411.47 431.79 462.41 485.90 523.17 536.79 557.58 614.24 657.86 729.24 811.14 812.99 846.46 865.28 883.17 942.42 979.89 1006.29 1037.82 1040.82 1075.05 1141.25 1194.90 1199.12 1213.62 1273.22 1336.86 1353.10 1371.80 1398.31 1418.38 1462.73 1480.84 1499.10 1561.38 1577.85 1671.82 1692.04 1746.45 3075.43 3150.03 3200.58 3205.59 3209.86 3220.61 3238.56 3565.22 3852.42 3894.37
frequency: 32.68 74.80 91.71 109.30 198.43 351.99 368.99 378.86 411.47 431.79 462.41 485.90 523.17 536.79 557.58 614.24 657.86 729.24 811.14 812.99 846.46 865.28 883.17 942.42 979.89 1006.29 1037.82 1040.82 1075.05 1141.25 1194.90 1199.12 1213.62 1273.22 1336.86 1353.10 1371.80 1398.31 1418.38 1462.73 1480.84 1499.10 1561.38 1577.85 1671.82 1692.04 1746.45 3075.43 3150.03 3200.58 3205.59 3209.86 3220.61 3238.56 3565.22 3852.42 3894.37
formula: C8H10NO2
InChI: InChI=1S/C8H10NO2/c1-6(10)9-7-2-4-8(11)5-3-7/h2-5,9-11H,1H3
21 atoms
C  0.15072 0.316175 -0.363335
C  -0.42711 -0.85073 -0.844541
C  -0.605001 1.267063 0.301303
C  -1.771249 -1.078055 -0.640679
C  -1.9542 1.043151 0.501868
C  -2.542463 -0.130985 0.033962
O  -3.842447 -0.411855 0.195183
N  1.553493 0.562317 -0.589814
C  2.531938 -0.007915 0.039989
C  2.348483 -0.987063 1.135809
O  3.725051 0.330347 -0.364129
H  1.814245 1.218471 -1.317821
H  0.16887 -1.5749 -1.386214
H  -0.146826 2.178454 0.664189
H  -2.247088 -1.977758 -1.00522
H  -2.550794 1.782334 1.02213
H  -4.301482 0.293782 0.654252
H  2.547174 -1.989466 0.749888
H  1.335481 -0.958138 1.525292
H  3.060452 -0.780914 1.935249
H  4.425806 -0.103018 0.133546
totalener: -515.89748299 hartree
nucrepener: 586.37040077 hartree
electener: -1102.26788376 hartree
oneelecener: -1849.56342895 hartree
twoeener: 747.29554519 hartree
kineticenergy: 513.34731527 hartree
xcener: -49.035324714937 hartree
chargesum: 1.0000000
charge: 0.029348 -0.149443 -0.165305 -0.093637 -0.101878 0.226068 -0.253241 -0.093233 0.383808 -0.211089 -0.195529 0.203577 0.150374 0.144350 0.150395 0.123712 0.202137 0.145314 0.136066 0.123707 0.244498
charge: -0.158259 0.001176 0.004638 0.022204 0.001715 -0.186351 0.393472 0.422409 -0.191693 0.064935 0.460866 0.034892 0.033519 0.034451 0.038519 0.029396 -0.095537 0.054718 0.046229 0.044456 -0.055756
qa: 0.0293 -0.1494 -0.1653 -0.0936 -0.1019 0.2261 -0.2532 -0.0932 0.3838 -0.2111 -0.1955 0.2036 0.1504 0.1444 0.1504 0.1237 0.2021 0.1453 0.1361 0.1237 0.2445
va: 3.6302 4.0808 4.1071 3.9798 3.9248 4.0315 2.2391 3.4047 3.9457 3.9300 2.3354 0.9899 0.9996 1.0085 1.0060 1.0080 1.0358 0.9936 1.0013 1.0080 1.0100
dispcorr: -0.007122048 hartree
energy: -515.906364971047
dipole: 4.05878 -1.32331 2.73547 -1.76022 1.92221 0.16199 3.15634 -2.48943 0.66691
magnitude: 2.82025 au
magnitude: 7.16851 debye
temp: 298.15 k
press: 1.00 atm
zeropoint: 0.17433440 hartree
thermalvibcorrection: 0.00746075 hartree
thermalrotcorrection: 0.00141627 hartree
thermaltrasncorrection: 0.00141627 hartree
thermaltotal: -515.72173727 hartree
thermalcorr: 0.01029329 hartree
nonthermalcorr: 0.17433440 hartree
totalcorr: 0.18462770 hartree
thermalcorrenthalpy: 0.00094421 hartree
totalenthalpy: -515.72079306 hartree
totalentropycorr: -0.04659376 hartree
gibbsenthalpy: -515.76738683 hartree
gibbsminuselec: 0.13897814 hartree
