program: Gaussian 09
title: 000005276
version: EM64L-G09RevD.01
frameworkgroup: C1[X(C19H18N2O3S)]
method: RPBEPBE
basis: SDD
operation: Freq
keyword: #p
keyword: freq=noraman
keyword: PBEPBE/SDD
title: #p freq=noraman PBEPBE/SDD
converged: YES YES NO NO
title: Mulliken charges:
elementType: S O O O N N C C C C C C C C C C C C C C C C C C C H H H H H H H H H H H H H H H H H H
charge: 0.138462 -0.236308 -0.363118 -0.278226 -0.638261 -0.049631 0.463863 -0.045905 0.572297 -0.674641 -0.862617 0.238426 -0.480474 -0.348812 -0.245565 -0.141259 0.151437 -0.244532 -0.222401 -0.684481 -0.207914 -0.219523 -0.225451 0.165832 -0.314674 0.243897 0.283175 0.298869 0.277739 0.277927 0.219849 0.217538 0.343577 0.254732 0.263424 0.211261 0.231228 0.234316 0.234680 0.236643 0.235438 0.350370 0.338814
chargesum: 0.00000
title: Mulliken charges with hydrogens summed into heavy atoms:
elementType: S O O O N N C C C C C C C C C C C C C C C C C C C
charge: 0.138462 -0.236308 -0.019541 -0.278226 0.050923 -0.049631 0.463863 -0.045905 0.572297 -0.430744 -0.280573 0.238426 -0.202735 -0.070886 0.191822 -0.141259 0.151437 0.010200 0.041023 -0.007676 0.026766 0.017120 0.009987 0.165832 -0.314674
polarizability: 3.44265656e+02 1.83095168e+01 2.79263147e+02 -4.26873595e+01 1.10344826e+01 2.01051117e+02
1716.lowfreq: -3.7417 -1.5373 -0.0007 0.0007 0.0011 1.1898 15.5945 18.4620 28.1844
frequency: 15.5059 18.4548 28.1285 34.9058 54.4882 63.2714 66.8160 79.2145 92.5491 103.6397 115.6459 134.2201 148.3057 164.7511 204.6447 211.1954 228.8393 238.7133 242.8042 266.8730 291.2686 299.2114 312.2979 339.6923 354.6105 387.6350 404.2241 408.0287 427.5142 471.7588 489.4760 497.7311 519.4997 529.9057 556.4858 558.6435 570.0561 609.3951 610.5712 612.8557 645.6075 659.2148 675.0624 681.7726 693.8556 696.4860 739.3182 753.9582 765.6449 782.3938 801.1685 825.2782 845.4167 851.3657 866.2496 882.0239 911.1682 931.0597 979.9636 985.1316 989.0273 1000.9223 1002.0969 1011.1833 1014.9641 1047.7662 1055.5990 1072.5329 1076.1866 1081.7268 1116.6032 1132.1315 1151.8451 1171.0862 1174.2222 1186.5605 1220.6146 1238.1896 1251.6871 1268.1698 1298.6765 1303.9407 1323.1325 1347.5231 1361.0798 1374.9483 1380.8502 1401.0131 1424.5840 1426.1593 1429.9512 1441.6084 1460.1039 1460.9503 1473.7076 1479.7419 1486.3275 1569.3815 1585.6473 1586.8110 1588.6408 1604.9204 1605.2150 1644.5423 2127.9595 2965.6198 2999.1128 3015.6823 3026.0013 3091.9579 3096.8065 3107.0781 3108.2491 3130.7547 3131.4514 3139.1502 3149.8259 3158.5542 3166.1788 3171.0993 3197.9909 3516.3903 3670.9961
redmass: 5.5133 5.4955 8.2516 4.0588 4.7951 5.5383 5.4423 5.9191 2.8983 4.2390 2.6700 6.4948 5.9921 6.5178 4.9955 5.7479 3.1010 1.9089 2.4970 3.7631 6.4887 4.9097 5.1388 5.1152 4.7153 9.1495 3.2067 3.9367 5.4767 4.4778 3.8709 6.4882 1.8594 4.0801 2.3617 2.0116 6.0726 5.8922 5.0576 1.8184 3.7601 4.2579 4.6480 5.1636 1.2973 2.0975 7.5431 1.4779 3.1667 5.9381 5.0712 1.1327 3.4632 1.2403 1.4737 1.6177 1.7880 1.4017 1.4109 5.8880 3.8935 1.3271 1.4480 3.0635 3.4948 3.2148 2.0611 2.1687 1.6887 3.4691 2.2111 1.4465 1.2580 2.1441 1.0546 1.1180 1.8572 1.2239 1.7010 1.1351 2.7562 1.3123 1.5481 3.5189 1.7017 9.7040 1.7493 1.2922 3.3138 1.9667 1.5609 2.7594 2.0706 1.0397 1.3650 1.9092 1.0964 3.4412 4.9835 5.9580 6.2025 1.9625 6.6576 3.3232 12.5852 1.0556 1.0362 1.0615 1.1076 1.0876 1.0990 1.1029 1.1015 1.0918 1.0851 1.0884 1.0929 1.0971 1.0677 1.1009 1.0901 1.0454 1.1041
irintensity: 0.2051 0.2328 0.0065 0.1862 3.6582 0.1893 0.3560 16.0044 2.0729 1.9452 0.4548 1.4201 9.9520 6.5253 2.6038 0.9782 2.2813 1.9225 1.1058 1.0895 2.1226 1.7422 0.6833 8.3739 1.0805 0.5198 0.2016 0.2210 12.0581 36.4702 4.0083 13.7332 1.4191 8.8486 96.9976 99.3365 21.6005 3.7648 13.2678 95.7330 4.0098 13.3040 3.7834 10.1791 105.9200 56.1662 26.1889 66.0361 12.8619 6.7038 1.7215 6.9574 11.2931 0.4367 2.7985 12.9889 9.7867 4.5069 0.5833 7.9096 5.5019 0.3272 17.1199 5.3899 9.9915 77.4529 27.9171 1.3158 9.9956 2.9360 5.3428 5.2383 7.0277 206.1075 0.5287 0.9879 263.6407 11.3288 65.2216 0.0624 482.6642 0.5430 32.8175 172.9566 5.1118 0.9777 4.5593 30.3639 11.6251 17.0223 74.9091 63.3061 22.2303 11.6542 83.1500 233.8413 1.7587 421.5927 72.8586 6.8410 5.7160 3.5301 48.9139 342.2869 87.6342 19.1536 23.2413 12.0779 25.2736 1.4516 20.7502 2.5933 31.5206 2.9300 0.8058 2.7877 10.7937 15.5843 678.2874 22.3031 7.5143 68.7201 50.0274
temp: 298.150 k
press: 1.00000 atm
elementType: 16 8 8 8 7 7 6 6 6 6 6 6 6 6 6 6 6 6 6 6 6 6 6 6 6 1 1 1 1 1 1 1 1 1 1 1 1 1 1 1 1 1 1
symmnumber: 1
zpe: 861487.1 jmol-1
zpe.correction: 0.328123 hartree
zpe.thermalcorrener: 0.352575 hartree
zpe.thermalcorrenthalpy: 0.353519 hartree
zpe.thermalcorrgfe: 0.270795 hartree
zpe.sumelectzpe: -1466.259110 hartree
zpe.sumelectthermal: -1466.234659 hartree
zpe.sumelectthermalent: -1466.233715 hartree
zpe.sumelectthermalfe: -1466.316438 hartree
dipole: 1.0821 -0.7959 1.1828
dipole: 1.7898
quadrupole: -149.6945 -155.5464 -145.0294
quadrupole: -9.8609 -3.7494 -2.3066
quadrupole: 0.3956 -5.4563 5.0607 -9.8609 -3.7494 -2.3066
hfenergy: -1466.5872336 hartree
pointgroup: C01 [X(C19H18N2O3S1)]
dipole: -0.5704397 0.0008968 0.4128458 debye
polarizability: 290.6987217|37.1192078|327.0557488|45.6709587|12.4779032|206.8254489 unknown
InChI: InChI=1S/C19H18N2O3S/c1-2-24-17-10-13(8-14(11-20)19(21)23)9-15(18(17)22)12-25-16-6-4-3-5-7-16/h3-10,22H,2,12,21H2,1H3
charge 0 multiplicity 1
43 atoms
S  -2.946843 -2.719102 -1.616225
O  2.200081 -2.446435 0.390636
O  0.037949 -3.314723 -0.900116
O  1.019967 5.072556 -1.266526
N  2.960981 5.335436 -0.017972
N  4.0995 2.239098 1.092474
C  -0.553268 -1.040815 -1.656577
C  0.285126 -1.952199 -0.949388
C  0.874003 0.838194 -0.900733
C  -0.258769 0.337595 -1.602397
C  -1.699925 -1.528976 -2.50498
C  1.441312 -1.470074 -0.248145
C  1.725916 -0.094486 -0.231255
C  1.082621 2.275489 -0.919945
C  3.414447 -2.002434 1.117768
C  -3.380642 -1.730225 -0.112925
C  2.066404 3.069481 -0.354307
C  -4.474716 -0.836321 -0.174061
C  -2.650117 -1.898486 1.086012
C  4.052476 -3.257026 1.704392
C  -4.833395 -0.094906 0.975158
C  -3.018033 -1.155477 2.231997
C  -4.105042 -0.252896 2.177642
C  1.964535 4.565425 -0.58763
C  3.160386 2.585276 0.427766
H  -0.912097 1.044052 -2.128135
H  -2.286049 -0.688738 -2.905586
H  -1.359114 -2.163769 -3.343632
H  2.600663 0.26538 0.31159
H  0.338397 2.865261 -1.477594
H  4.097183 -1.49056 0.410005
H  3.123963 -1.283519 1.910456
H  -0.922786 -3.500613 -1.154362
H  -5.041121 -0.729416 -1.105117
H  -1.811582 -2.601358 1.130059
H  4.968603 -2.987385 2.260364
H  3.357068 -3.76204 2.395984
H  4.322412 -3.967211 0.90465
H  -5.680178 0.598538 0.931061
H  -2.453604 -1.282858 3.161957
H  -4.385624 0.32147 3.067322
H  3.722452 4.929633 0.525612
H  2.92366 6.344064 -0.156198
