program: Gaussian 09
title: 000044782
version: EM64L-G09RevD.01
frameworkgroup: C1[X(C21H28ClN)]
method: RPBEPBE
basis: SDD
operation: Freq
keyword: #p
keyword: freq=noraman
keyword: PBEPBE/SDD
title: #p freq=noraman PBEPBE/SDD
converged: YES YES NO NO
title: Mulliken charges:
elementType: Cl N C C C C C C C C C C C C C C C C C C C C C H H H H H H H H H H H H H H H H H H H H H H H H H H H H
charge: -0.081308 -0.114228 0.308610 -0.558928 -0.543833 -0.002187 0.393829 0.369214 -0.368990 -0.752844 -0.403623 -0.340110 -0.364107 -0.400819 -0.693769 -0.647510 -0.617675 -0.260713 -0.253592 -0.268447 -0.269287 -0.254944 -0.250256 0.239906 0.195286 0.307065 0.206245 0.208382 0.259706 0.213463 0.223965 0.223894 0.255346 0.271532 0.252416 0.212423 0.239688 0.197761 0.217300 0.255064 0.195571 0.226465 0.212423 0.225763 0.190636 0.222941 0.226356 0.221852 0.221707 0.225150 0.227207
chargesum: 0.00000
title: Mulliken charges with hydrogens summed into heavy atoms:
elementType: Cl N C C C C C C C C C C C C C C C C C C C C C
charge: -0.081308 -0.114228 0.308610 -0.123735 -0.236768 0.204058 0.393829 0.369214 0.099099 -0.091523 -0.148277 -0.068579 -0.111691 -0.188396 -0.039021 0.029591 0.011148 -0.037772 -0.027235 -0.046595 -0.047580 -0.029793 -0.023049
polarizability: 2.55298874e+02 4.24759278e+00 2.41271587e+02 1.84596187e+01 1.65859437e+01 2.09160789e+02
1716.lowfreq: -9.3883 -0.0018 -0.0016 -0.0015 5.7174 10.4384 36.5810 42.8539 58.5282
frequency: 36.5562 42.8059 58.4651 65.0418 73.0993 77.5284 85.8404 99.2688 112.2847 121.6631 143.6350 168.0097 178.6807 203.3897 210.7452 228.7447 233.8242 244.7501 250.4028 256.1058 265.0652 274.3744 282.3723 293.9175 319.1899 337.4635 394.2641 398.6465 403.4912 409.3762 465.4293 482.7153 505.3734 511.5495 574.3262 583.6119 617.2935 617.5693 628.1376 654.9162 702.9263 704.4037 712.4689 722.7027 767.2338 780.6270 794.9258 817.2047 847.2835 851.2886 875.7551 902.8872 919.0236 922.2735 932.6266 956.5462 973.7557 977.4535 988.7039 990.0593 992.4720 994.3355 995.6469 1015.7811 1027.2938 1034.5767 1039.3574 1040.7999 1050.0025 1072.9316 1082.0094 1086.6652 1094.7524 1104.7987 1121.4522 1133.5608 1147.9888 1156.7448 1163.8357 1172.7453 1174.3923 1199.6887 1204.6827 1209.5562 1236.5378 1259.2195 1276.5890 1279.6800 1296.4672 1314.7683 1327.1528 1330.6760 1339.9569 1355.6849 1369.5075 1374.4056 1375.6417 1378.4399 1389.1437 1420.7297 1430.0981 1434.6282 1441.4759 1453.1711 1457.7737 1459.9634 1465.6312 1470.5955 1472.5995 1478.1372 1483.4216 1485.1531 1486.2713 1486.3960 1491.9082 1585.0255 1589.4756 1608.3692 1610.5434 2859.9879 2881.1665 2973.9236 2975.8732 2976.9762 2990.5291 3004.0746 3004.7120 3027.1486 3046.9755 3060.9734 3061.3257 3063.2584 3073.0372 3074.7584 3077.2224 3090.6224 3093.3899 3114.4126 3120.5264 3123.7090 3130.9328 3137.0367 3145.9400 3156.0676 3157.5016 3170.7399 3183.4935
redmass: 3.4057 4.3380 4.1755 3.8063 2.9435 3.8952 3.8689 3.6667 4.6037 2.9656 2.3547 2.9965 1.1809 1.7712 2.5778 1.2531 1.2714 3.4494 2.4549 3.5968 2.4536 3.2442 3.1722 3.9115 3.2464 2.6394 3.1891 2.3560 2.7600 2.8488 3.2145 3.2332 3.2843 2.5712 3.4826 3.9592 6.3019 6.1849 4.5181 3.6552 1.8569 1.5599 2.7587 3.1011 2.2225 2.1027 1.4645 2.2539 1.2577 1.2562 2.0465 1.9531 1.5365 1.5404 1.8715 2.4831 1.3945 1.3822 1.6166 4.2877 3.5241 2.3913 1.5642 3.2342 2.5110 2.2861 2.3226 1.5395 1.7256 2.0519 1.8502 1.2936 1.6625 2.1014 2.2094 1.7021 1.9022 2.0752 2.5236 1.0652 1.0780 1.4242 1.2315 1.8491 1.2476 1.7534 1.7201 1.4397 1.1881 1.3360 1.3756 1.3128 1.4135 1.5179 1.3759 3.0334 1.2687 7.0288 1.2109 1.1429 2.2393 2.2385 1.1427 1.0644 1.0697 1.0700 1.0473 1.0666 1.0486 1.0585 1.0782 1.9996 1.3987 1.3990 1.0586 5.7132 5.9578 5.9075 5.9789 1.0555 1.0557 1.0782 1.0415 1.0361 1.0632 1.0682 1.0667 1.0761 1.0932 1.0963 1.0922 1.1006 1.0983 1.0962 1.0994 1.0986 1.0996 1.0856 1.0843 1.0875 1.0882 1.0936 1.0924 1.0993 1.0967 1.0976 1.0941
irintensity: 0.0892 0.1029 0.1741 0.1903 0.2211 0.2726 0.1951 1.0277 0.4799 0.2667 0.4597 0.2832 0.1079 0.7048 0.6272 0.0452 0.4545 2.7474 0.3196 0.2652 0.9225 1.0747 2.6019 1.1800 1.2075 0.6709 4.0507 6.3715 1.0318 0.0341 5.5807 11.7646 7.1237 1.4477 31.6026 1.8266 0.8267 0.1833 12.0343 4.9193 30.4898 77.2690 12.0611 8.9240 32.3020 12.8409 33.8744 13.4484 0.5632 0.4065 11.9968 8.4034 1.9801 0.6943 2.6000 12.2827 0.7631 0.4593 0.0988 1.6445 2.7681 1.3135 1.9308 6.0516 35.6804 7.0688 10.2612 7.8138 3.7562 7.8183 7.8160 6.0315 8.0800 11.5416 1.1876 19.4258 6.8479 12.0477 5.7872 0.0342 0.2885 2.5586 3.2278 9.3047 5.0266 4.5863 19.5621 3.2591 13.6067 2.9381 1.4779 1.8206 5.5233 2.3772 14.7949 4.0103 11.1401 0.7599 19.3033 4.7149 12.5670 4.9711 7.9204 4.1922 8.6281 7.9299 8.1800 17.1322 9.4113 22.5983 2.0626 17.2975 37.8497 1.6123 9.9225 1.5191 0.0419 9.4532 3.2922 116.4410 169.4467 36.7197 27.8806 27.5914 15.8271 2.8373 57.3984 27.2622 1.9034 4.1001 14.6126 28.0481 91.7725 22.2969 37.3097 22.2354 23.4301 5.6773 1.4159 2.3589 6.7188 32.6983 42.3438 43.2828 31.5691 5.1147 6.9496
temp: 298.150 k
press: 1.00000 atm
elementType: 17 7 6 6 6 6 6 6 6 6 6 6 6 6 6 6 6 6 6 6 6 6 6 1 1 1 1 1 1 1 1 1 1 1 1 1 1 1 1 1 1 1 1 1 1 1 1 1 1 1 1
symmnumber: 1
zpe: 1141582.5 jmol-1
zpe.correction: 0.434806 hartree
zpe.thermalcorrener: 0.458767 hartree
zpe.thermalcorrenthalpy: 0.459711 hartree
zpe.thermalcorrgfe: 0.382234 hartree
zpe.sumelectzpe: -1330.086043 hartree
zpe.sumelectthermal: -1330.062082 hartree
zpe.sumelectthermalent: -1330.061138 hartree
zpe.sumelectthermalfe: -1330.138615 hartree
dipole: 1.8320 -1.3985 -2.3524
dipole: 3.2933
quadrupole: -139.2324 -139.2316 -148.8646
quadrupole: -0.7342 5.2857 2.9681
quadrupole: 3.2105 3.2113 -6.4217 -0.7342 5.2857 2.9681
hfenergy: -1330.5208487 hartree
pointgroup: C01 [X(C21H28Cl1N1)]
dipole: -0.6067669 -0.6260756 0.9584589 debye
polarizability: 256.9486679|-1.2596569|239.2801696|20.204719|-14.4395706|209.5024116 unknown
InChI: InChI=1S/C21H28ClN/c1-5-20(22)21(16-17(2)23(3)4,18-12-8-6-9-13-18)19-14-10-7-11-15-19/h6-15,17,20H,5,16H2,1-4H3
charge 0 multiplicity 1
51 atoms
Cl 1.072484 -0.506555 -2.714059
N  -2.729202 -1.166475 0.29742
C  0.308992 -0.175168 0.07654
C  -0.402285 -0.867191 1.317129
C  0.356435 -1.238884 -1.072842
C  -1.634804 -1.791281 1.088095
C  -0.527795 1.086664 -0.284085
C  1.765327 0.25604 0.443709
C  1.186108 -2.501814 -0.786755
C  -2.086614 -2.363143 2.46689
C  -0.480414 2.194733 0.605383
C  2.392835 1.279601 -0.320367
C  -1.375409 1.184306 -1.413759
C  2.540684 -0.36686 1.456715
C  0.958073 -3.631696 -1.811309
C  -3.458257 -0.071291 0.965721
C  -3.647582 -2.142768 -0.319925
C  -1.247329 3.357508 0.378107
C  3.728224 1.664307 -0.081886
C  -2.14088 2.348666 -1.650929
C  3.878365 0.020179 1.705455
C  -2.083944 3.442602 -0.758579
C  4.482504 1.037246 0.936466
H  -0.667117 -0.064151 2.030494
H  0.325776 -1.507599 1.843956
H  -0.674831 -1.489361 -1.370787
H  -1.299551 -2.657292 0.481331
H  0.9218 -2.872014 0.223484
H  2.255387 -2.227577 -0.745518
H  -1.275168 -2.952464 2.932946
H  -2.961147 -3.029239 2.352446
H  -2.360376 -1.553541 3.168044
H  0.180706 2.153762 1.479608
H  1.824492 1.778828 -1.109882
H  -1.451764 0.356306 -2.120558
H  2.120362 -1.162378 2.079146
H  1.246821 -3.305872 -2.825293
H  -0.105732 -3.937618 -1.841476
H  1.559112 -4.521611 -1.550542
H  -2.752107 0.672477 1.368749
H  -4.122077 -0.418095 1.795011
H  -4.088131 0.449522 0.221928
H  -3.070813 -2.909419 -0.870186
H  -4.299187 -1.621224 -1.045148
H  -4.314163 -2.670756 0.40755
H  -1.184763 4.195721 1.081607
H  4.179364 2.453953 -0.693356
H  -2.781731 2.399106 -2.538868
H  4.444854 -0.478374 2.500542
H  -2.676913 4.344987 -0.946455
H  5.51918 1.337197 1.126791
