program: Gaussian 16
title: Title Card Required
version: EM64L-G16RevB.01
method: UM06
basis: Gen
operation: Freq
keyword: #
keyword: freq
keyword: gen
keyword: scrf=(iefpcm,solvent=water)
keyword: density=current
keyword: m06
keyword: geom=check
title: # freq gen scrf=(iefpcm,solvent=water) density=current m06 geom=check
converged: YES YES NO YES
elementType: N
elementType: C
elementType: H
elementType: Co
1716.lowfreq: -12.3147 -11.0318 -9.8040 0.0029 0.0034 0.0045 18.0730 34.2235 37.9065
frequency: 18.0632 33.9631 37.9050 39.3179 39.9043 44.0586 59.1917 65.8935 75.6997 82.0278 110.1480 114.4471 117.9897 118.8017 127.1407 132.7237 146.3174 147.6632 192.8797 202.4554 207.7887 212.6689 225.0099 227.2853 247.9122 248.9019 259.1014 268.8036 277.0503 280.7087 286.2569 300.9409 301.4444 311.1993 312.9110 365.0244 371.7649 409.9543 412.2250 413.6729 413.8394 430.2715 440.9157 486.4121 486.6307 487.5843 492.7906 493.2354 509.6518 528.0091 530.7370 573.0284 577.6764 577.9064 580.5811 602.7513 615.7356 641.9110 645.3329 650.7084 650.7382 658.1156 665.4144 666.7977 682.0846 685.5589 695.7204 705.2446 715.8885 742.7050 742.8760 746.2899 750.8391 764.9387 765.6267 766.2583 795.7036 798.5816 799.1767 801.5486 806.5429 809.0479 810.6439 810.9262 813.4962 826.0914 826.2399 863.9330 865.1185 869.3571 887.1241 907.9242 908.9408 908.9451 909.7719 918.4016 919.3157 925.6220 962.1713 963.1271 990.9318 991.0196 991.0247 991.0766 1028.3442 1028.3870 1028.3998 1028.4304 1031.7444 1031.7568 1031.8510 1032.2416 1061.4525 1066.9890 1067.5161 1086.7658 1092.9248 1096.3558 1096.9349 1110.7321 1113.1138 1113.6856 1138.5101 1138.9911 1152.8663 1157.8724 1158.0665 1165.3422 1165.5712 1176.5539 1201.0365 1212.8572 1214.5793 1214.9733 1216.0439 1216.0816 1293.1314 1303.3449 1303.4685 1305.0317 1313.2109 1362.5127 1369.4864 1373.5530 1373.5896 1386.3144 1389.8738 1390.0439 1412.7398 1444.5223 1444.9985 1448.8931 1455.7636 1461.4878 1464.6552 1490.4609 1493.6312 1494.9167 1495.8718 1501.5163 1504.8827 1505.4634 1513.0955 1547.6385 1562.7649 1563.4861 1582.8993 1590.2853 1614.6234 1647.5707 1649.1056 1649.1659 1649.9789 1656.1185 1656.7210 1656.7236 1658.8605 2295.3114 3191.9169 3191.9231 3191.9668 3191.9730 3199.7278 3199.7507 3199.7763 3199.8038 3206.3970 3206.4241 3206.4508 3206.4777 3211.1051 3211.1301 3211.1506 3211.2955 3276.6292 3278.9201 3300.0688 3636.9540
redmass: 6.1616 6.2692 6.5135 6.6611 3.5033 5.5506 9.3546 10.1649 5.9425 5.1982 5.1128 3.8808 5.1021 5.1181 5.4868 5.5732 7.7494 6.3319 6.2253 7.9962 6.0171 5.5432 5.2439 11.1120 6.9472 6.9910 8.1333 7.6764 10.5246 9.0135 10.1074 7.6475 7.7429 9.1556 12.6003 12.1274 10.9011 6.1963 3.0919 3.1632 3.2125 4.8084 5.0967 4.9159 5.1181 5.6207 8.3323 8.5313 4.1309 8.4941 9.0281 8.1090 8.5366 8.5476 7.8257 9.0954 2.5275 7.8899 4.5920 7.9820 7.7068 2.3675 4.9536 4.6290 1.5543 8.8814 7.0772 5.8788 2.6630 2.0026 1.9391 1.2394 1.6181 11.4315 8.7116 9.0479 1.8201 2.8622 2.9469 4.4399 5.0380 6.1505 3.7419 3.7116 3.4101 6.2275 6.2318 7.6921 1.4476 6.9003 1.3763 1.4436 1.4538 1.4543 1.4615 9.1420 9.1614 5.2597 4.6644 7.2022 1.4041 1.4043 1.4046 1.4046 1.3581 1.3584 1.3585 1.3585 1.9322 1.9326 1.9538 1.9426 7.0562 7.4424 6.2374 4.2073 1.6163 3.2942 3.4840 1.7194 2.2493 1.2675 1.7556 1.7440 1.5767 1.6312 1.1507 1.2252 1.2341 2.0490 2.8779 2.5679 3.2555 3.2535 2.9657 3.6500 1.4805 1.5974 1.5988 1.6113 1.7430 10.2448 4.2948 9.3565 9.4469 8.8346 8.2308 8.3416 6.0013 3.6347 3.5624 4.8807 3.4480 10.1829 3.5715 3.0398 3.8078 3.6843 3.7611 2.9081 3.4883 3.6709 5.8831 3.7466 10.0172 10.0295 9.2137 3.7341 12.6399 7.5344 7.5834 7.5880 7.5550 7.7205 7.7155 7.7151 7.7803 13.4008 1.0872 1.0872 1.0872 1.0872 1.0901 1.0901 1.0901 1.0901 1.0947 1.0947 1.0947 1.0947 1.0981 1.0981 1.0981 1.0981 1.0993 1.0937 1.1088 1.0840
irintensity: 0.0187 2.1274 0.9080 0.5402 1.8012 0.0378 2.0540 0.6229 0.5202 0.1244 0.2174 0.0000 4.9550 2.9679 0.1164 1.1815 9.8566 0.0039 1.7046 0.0007 0.0536 0.0001 0.6454 0.4283 0.0605 0.0015 3.8330 2.4580 4.2167 0.1395 1.0640 0.0001 0.0004 0.0096 17.2848 7.7127 5.9759 11.7311 0.0021 0.1613 0.0094 10.2332 0.0000 2.7547 1.7389 0.1725 12.0146 9.1353 0.0096 0.0548 0.0188 0.0013 11.3859 10.9500 0.0000 0.0047 67.8506 0.0394 0.1190 0.0653 0.2958 52.6341 0.0023 4.9079 36.0278 0.0464 0.3618 0.0009 0.0564 2.7511 11.4645 45.5210 445.4826 0.0193 2.7995 1.8170 0.0248 0.0390 0.3539 0.0188 0.0014 0.0001 0.0153 0.1601 1.3504 1.4936 2.0361 0.1061 13.8478 0.0487 0.1986 0.0008 0.1081 0.2638 0.0004 0.6133 0.6511 1.1566 2.0066 2.4453 2.4883 0.1819 0.0093 0.0010 0.0001 0.0139 0.0111 0.0004 0.0045 0.0087 0.0000 0.0015 10.1336 0.2538 13.2517 0.0190 94.2238 1.4000 3.4843 1.0557 0.0016 41.2623 0.2685 0.2057 0.0053 37.9359 0.0004 26.4170 30.4221 0.0475 0.0011 0.1334 71.9225 78.2739 6.6285 0.1772 10.4933 19.6360 18.0668 0.0133 0.0100 1.1474 33.4051 1794.5338 1775.6130 0.4454 182.9606 213.6302 0.1351 0.6181 0.0152 2.6091 7.4788 0.0002 1.6685 0.0043 186.0369 188.3749 4.0257 0.0003 2.8614 8.7644 1.6653 77.0256 1.3827 0.3722 0.4020 14.3970 0.1233 0.0064 42.7034 36.8318 0.7482 0.4048 69.8377 71.5909 0.1015 297.5342 1.5285 1.5708 1.6697 1.1672 1.0617 2.3327 1.9981 0.7636 1.7633 3.7579 4.5146 1.5431 33.1949 74.2442 41.0885 1.4494 6.9772 26.2245 1.6836 282.5301
temp: 298.150 k
press: 1.00000 atm
elementType: 7 6 6 7 7 6 6 6 6 1 6 1 1 1 6 6 6 6 6 1 6 1 1 1 6 6 6 7 7 7 6 6 7 7 6 6 6 6 1 6 1 1 1 6 6 6 6 6 1 6 1 1 1 6 6 6 27 7 6 6 1 6 1 1 1 7 6 8
symmnumber: 1
zpe: 1306168.7 jmol-1
zpe.correction: 0.497493 hartree
zpe.thermalcorrener: 0.532363 hartree
zpe.thermalcorrenthalpy: 0.533307 hartree
zpe.thermalcorrgfe: 0.430467 hartree
zpe.sumelectzpe: -3388.091894 hartree
zpe.sumelectthermal: -3388.057024 hartree
zpe.sumelectthermalent: -3388.056080 hartree
zpe.sumelectthermalfe: -3388.158921 hartree
dipole: -1.6326 0.0001 5.6207
dipole: 5.8530
quadrupole: -144.7697 -154.1467 -226.4813
quadrupole: -0.0004 -6.1903 0.0036
quadrupole: 30.3629 20.9859 -51.3487 -0.0004 -6.1903 0.0036
hfenergy: -3388.5893876 hartree
pointgroup: C01 [X(C36H20Co1N10O1)]
dipole: 0.4835264 -0.4147042 2.2129055 debye
polarizability: 1463.3417886|-10.5901157|1460.1384422|0.7236851|-1.2028252|396.1538934 unknown
InChI: InChI=1S/C32H16N8.C3H4N2.CO.Co/c1-2-10-18-17(9-1)25-33-26(18)38-28-21-13-5-6-14-22(21)30(35-28)40-32-24-16-8-7-15-23(24)31(36-32)39-29-20-12-4-3-11-19(20)27(34-29)37-25;1-2-5-3-4-1;1-2;/h1-16H;1-4H;;/q-4;-1;;+5
charge 2 multiplicity 2
68 atoms
N  2.17490182 2.52896109 -0.08458699
C  2.63822406 1.30407736 -0.13905655
C  0.89444507 2.80278872 -0.14759585
N  -0.14697632 1.92496454 -0.23293277
N  1.92678315 0.14161666 -0.21937901
C  0.38140812 4.15725784 -0.16945169
C  1.01240999 5.38130852 -0.10351157
C  -1.80615074 5.17214392 -0.34928107
C  0.20584989 6.51075635 -0.16261131
H  2.08660261 5.45686925 -0.00912526
C  -1.17583265 6.40823776 -0.28375025
H  -2.87973849 5.08817904 -0.44340895
H  0.65922006 7.49095711 -0.11381981
H  -1.76939455 7.31072306 -0.32750639
C  4.05430383 1.00024946 -0.15557479
C  4.16124313 -0.38176195 -0.27003395
C  5.1693899 1.8084867 -0.09020263
C  5.38722254 -1.01060648 -0.32213457
C  6.40741494 1.18072039 -0.14261814
H  5.08224927 2.88225112 -0.00108717
C  6.51420773 -0.20126418 -0.2569779
H  5.46595155 -2.08503482 -0.41103755
H  7.3081496 1.77655895 -0.09391423
H  7.49582168 -0.65253248 -0.29567998
C  -1.00037531 4.05486463 -0.29068889
C  2.80829178 -0.89733386 -0.30063028
C  -1.30644906 2.63959504 -0.31971087
N  2.53537463 -2.17951012 -0.35925105
N  -2.53272505 2.17700235 -0.38211705
N  -2.17371072 -2.52994002 -0.0821779
C  -2.63672926 -1.30517007 -0.14548049
C  -0.89315617 -2.80410167 -0.13734905
N  0.14921695 -1.92625265 -0.21872997
N  -1.92524771 -0.14376852 -0.23206499
C  -0.38018561 -4.15854788 -0.15336094
C  -1.01177793 -5.38233165 -0.08700952
C  1.80796752 -5.17448641 -0.32020716
C  -0.20523495 -6.51207069 -0.13909751
H  -2.08641562 -5.45736176 0.00259276
C  1.1770706 -6.41019575 -0.25407899
H  2.8820018 -5.09103589 -0.40956888
H  -0.65903974 -7.49203586 -0.08962891
H  1.7706045 -7.31294222 -0.2924829
C  -4.05286119 -1.00127688 -0.16638911
C  -4.1591781 0.38014385 -0.28837639
C  -5.16823053 -1.80887482 -0.09910761
C  -5.3848297 1.00898875 -0.34641746
C  -6.40603007 -1.18107777 -0.15759809
H  -5.08158623 -2.88217998 -0.0041485
C  -6.51221504 0.20025985 -0.27949057
H  -5.46308027 2.08295697 -0.44112164
H  -7.30701278 -1.77644623 -0.10773613
H  -7.49361853 0.65157508 -0.32273799
C  1.0021668 -4.05682157 -0.26843805
C  -2.80589068 0.89517562 -0.31871669
C  1.30875955 -2.64183841 -0.29994118
Co 0.00042229 -0.00039293 -0.21217787
N  -0.01503031 0.01364137 1.73439688
C  0.78677794 -0.67554541 2.52492419
C  -0.85644324 0.73765926 2.54802621
H  1.56925199 -1.34856484 2.22283325
C  -0.5447085 0.47019282 3.83822641
H  -1.6186581 1.39297006 2.1688561
H  0.96115979 -0.82452195 4.59276678
H  -0.96320891 0.83057216 4.7592133
N  0.49135939 -0.42085753 3.79908614
C  0.00828441 -0.00755945 -2.12642956
O  0.01312982 -0.01180145 -3.24159832
