program: Gaussian 16
title: co-pc-Im_CO2_+1_3_pcm.m6.pc2 geom
version: EM64L-G16RevB.01
method: UM06
basis: Gen
operation: Freq
keyword: #
keyword: freq
keyword: m06/gen
keyword: density=current
keyword: scrf=(iefpcm,solvent=water)
title: # freq m06/gen density=current scrf=(iefpcm,solvent=water)
converged: YES YES NO NO
elementType: N
elementType: C
elementType: H
elementType: Co
elementType: O
1716.lowfreq: -10.7085 -0.0015 0.0018 0.0036 3.3737 5.4505 7.7659 14.9096 21.1630
frequency: -10.3447 14.8951 21.0579 23.4639 27.7366 33.5965 34.7410 37.9930 48.9329 64.6123 68.8477 81.7786 112.7892 113.4036 114.0038 121.7157 123.8303 124.5446 127.7627 134.8554 137.9347 143.4322 160.2424 192.1627 210.6010 212.6349 216.2333 232.3687 250.1878 252.2117 259.7192 290.0675 292.8495 301.9705 302.6894 303.7198 304.8922 353.2423 353.7117 367.5853 417.0383 417.1531 417.4207 428.9410 443.8657 489.8240 492.4870 492.7385 516.9624 523.2940 523.6427 568.7804 578.3076 578.5366 584.2333 596.3785 600.8730 638.0502 648.7952 649.0946 649.1470 653.9113 668.2361 668.3667 682.4272 691.4800 693.8150 697.6103 710.1070 715.6870 720.4830 745.5353 746.0411 754.1143 756.8599 766.0009 766.4636 769.9781 795.9832 800.9195 801.2312 801.6631 806.3495 810.6664 813.6267 814.6100 818.1365 822.2496 822.5016 853.5008 859.8551 865.4608 883.9077 906.3291 907.1307 907.5084 908.0769 920.8184 921.1228 924.9365 942.7689 966.5530 986.3535 986.3999 986.8501 986.9211 1022.6057 1022.7094 1023.5384 1023.5460 1032.1481 1032.3655 1032.6423 1032.9732 1067.8153 1071.2398 1072.7100 1084.2256 1096.4030 1096.6702 1096.9608 1109.9371 1118.0462 1119.1259 1138.8088 1139.2814 1150.8807 1152.0027 1157.5517 1165.3264 1165.4273 1175.1891 1192.7776 1195.3319 1210.6717 1210.8756 1210.9452 1225.8365 1290.4284 1301.6170 1301.8704 1303.3682 1315.8795 1354.8865 1368.6002 1368.9014 1372.5571 1379.3241 1395.3881 1395.5346 1406.0594 1411.0565 1437.6187 1443.7040 1444.3594 1446.5682 1457.2749 1467.1059 1491.8332 1495.7880 1496.3206 1497.7404 1501.3091 1506.1908 1506.5315 1507.1473 1526.5849 1567.3560 1567.4260 1574.3162 1578.3562 1611.8215 1654.5262 1654.8028 1655.0757 1656.4860 1658.0918 1658.7030 1658.8183 1660.4368 2449.6634 3186.9372 3186.9661 3187.0588 3187.1846 3195.4734 3195.5688 3195.5878 3195.7379 3202.6368 3202.6762 3202.7881 3202.8468 3207.2992 3207.3895 3207.4663 3207.6443 3245.0435 3254.3739 3286.9256 3651.1194
redmass: 3.5848 6.2016 5.9926 12.1857 13.7762 6.6399 8.9769 7.4397 5.4382 5.7884 8.9658 6.5065 5.0425 3.9405 5.0801 5.3122 5.7545 5.6773 8.5952 7.7667 5.6665 6.5852 4.8200 8.0730 11.8797 6.3609 5.5631 11.5315 6.7288 6.7538 7.5708 10.0509 10.1337 7.6196 7.7826 7.9912 8.7580 20.3405 20.4012 14.1541 3.0963 3.0993 3.0963 3.2027 5.2198 5.5682 4.6115 4.6154 4.1916 7.3345 7.3358 8.1458 8.5472 8.5481 7.8331 1.9366 9.0365 7.8918 7.9653 8.1014 4.6233 1.8947 4.8857 4.8263 2.2563 8.8996 12.8673 7.0475 5.9754 12.7195 2.5116 1.8636 1.8839 1.5063 1.2305 9.1103 9.0987 11.8917 1.9055 2.8618 2.8230 6.0522 4.4689 5.0575 4.3338 4.3434 4.0551 6.2013 6.1726 1.4368 7.7963 6.9784 1.3851 1.4417 1.4557 1.4529 1.4606 9.3266 9.3249 5.7736 4.0398 9.8738 1.4052 1.4053 1.4047 1.4043 1.3443 1.3441 1.3433 1.3431 1.9356 1.9467 1.9387 1.9470 6.8864 5.4894 5.2471 1.5535 2.7243 4.0291 4.1684 1.3567 1.6284 3.3358 1.6924 1.6857 1.5394 1.6917 1.1757 1.2362 1.2315 1.8806 4.1295 2.8548 3.2451 3.3092 3.3848 2.7011 1.3977 1.5915 1.5893 1.5994 1.8440 9.7504 8.0824 8.7726 4.0239 8.6169 8.9205 8.9382 15.9902 5.9618 3.2744 3.6967 3.6357 4.5138 10.2850 3.8989 3.0623 3.3180 3.2593 4.6169 2.8878 4.5555 3.9066 4.0557 3.4403 10.4787 10.4230 3.7339 7.8846 12.5943 7.5874 7.5995 7.5956 7.6095 7.7158 7.7106 7.7094 7.7771 12.8765 1.0868 1.0868 1.0868 1.0868 1.0899 1.0899 1.0899 1.0899 1.0944 1.0944 1.0944 1.0944 1.0979 1.0978 1.0979 1.0979 1.0941 1.0983 1.1047 1.0834
irintensity: 0.9157 0.0639 3.4922 0.4250 0.0594 1.6837 0.2556 0.3700 0.1127 0.7983 0.1438 0.1340 6.1998 0.3360 0.0731 5.6262 2.8448 1.0330 1.9802 0.8831 3.2242 0.0705 1.6391 0.0049 20.6105 0.7100 0.1611 0.0493 0.0436 0.0587 0.0046 0.2321 0.1053 0.2770 0.2734 7.0152 0.1898 0.5758 0.6694 0.0286 0.0134 0.0118 0.0195 19.5541 0.0037 0.0307 0.0081 0.0093 0.0031 8.7676 8.8466 0.0030 15.1208 14.7587 0.0069 113.3419 0.1535 0.0014 0.3134 0.0652 0.2229 52.1533 0.1964 0.3910 0.3353 0.0237 46.0882 0.0692 0.0094 53.7163 0.0383 0.1926 1.2224 466.4643 53.6903 9.0855 7.5238 0.1019 0.0665 0.1638 0.0191 0.0024 0.0129 0.0111 0.3163 0.2121 0.1557 3.1176 2.8432 23.2448 0.0172 0.0139 0.1236 0.0016 0.0580 0.0604 0.0008 0.5830 0.7571 6.7752 0.1880 0.0565 1.8738 0.4208 0.6999 0.5445 0.0019 0.0015 0.0001 0.0001 1.6316 0.5117 1.6768 0.4963 0.3400 54.3155 56.0073 82.3793 1.6322 22.5999 26.4016 54.4488 0.1511 0.0104 3.5835 2.8726 15.1123 0.4042 0.0012 30.4466 27.3974 0.1613 9.0572 0.0027 16.2789 11.4877 5.9541 0.0353 6.8256 5.3894 5.2260 0.0042 0.0176 0.3237 1138.3410 1183.6131 78.1726 0.5338 221.9145 225.9274 0.2014 0.0936 19.4442 2.2980 0.5126 1.5499 0.0353 0.9276 0.0154 213.5273 198.9648 1.4566 0.0290 2.1181 48.2093 52.6377 65.8706 2.7789 1.2691 17.0118 2.1726 0.0175 0.2382 26.8167 28.4199 0.1465 0.1098 58.5046 59.7801 0.2027 997.6395 1.7031 1.5376 1.6136 1.5755 4.0316 4.3359 3.9527 3.6602 8.0237 8.1347 9.4626 7.2836 62.3407 36.7094 62.3210 16.6504 8.2709 4.0913 0.8709 191.5648
temp: 298.150 k
press: 1.00000 atm
elementType: 7 6 6 7 7 6 6 6 6 1 6 1 1 1 6 6 6 6 6 1 6 1 1 1 6 6 6 7 7 7 6 6 7 7 6 6 6 6 1 6 1 1 1 6 6 6 6 6 1 6 1 1 1 6 6 6 27 7 6 6 1 6 1 1 1 7 6 8 8
symmnumber: 1
zpe: 1314138.8 jmol-1
zpe.correction: 0.500529 hartree
zpe.thermalcorrener: 0.536799 hartree
zpe.thermalcorrenthalpy: 0.537743 hartree
zpe.thermalcorrgfe: 0.428376 hartree
zpe.sumelectzpe: -3463.559706 hartree
zpe.sumelectthermal: -3463.523436 hartree
zpe.sumelectthermalent: -3463.522492 hartree
zpe.sumelectthermalfe: -3463.631858 hartree
dipole: 1.4869 -0.0518 6.2658
dipole: 6.4400
quadrupole: -193.1803 -197.0135 -243.0068
quadrupole: -0.8613 8.2336 -0.4020
quadrupole: 17.8866 14.0533 -31.9399 -0.8613 8.2336 -0.4020
hfenergy: -3464.0602346 hartree
pointgroup: C01 [X(C36H20Co1N10O2)]
dipole: -0.5849908 0.0203927 2.4651535 debye
polarizability: 1436.3161819|0.2925852|1399.4008564|-0.9671987|2.5028266|377.6016835 unknown
InChI: InChI=1S/C32H16N8.C3H4N2.CO2.Co/c1-2-10-18-17(9-1)25-33-26(18)38-28-21-13-5-6-14-22(21)30(35-28)40-32-24-16-8-7-15-23(24)31(36-32)39-29-20-12-4-3-11-19(20)27(34-29)37-25;1-2-5-3-4-1;2-1-3;/h1-16H;1-4H;;/q-4;-1;;+5
charge 1 multiplicity 3
69 atoms
N  -0.287118 -3.326536 -0.060419
C  -1.379921 -2.598011 -0.078419
C  0.914222 -2.795743 -0.094183
N  1.240769 -1.475499 -0.104438
N  -1.476156 -1.240656 -0.083212
C  2.120974 -3.605762 -0.154956
C  2.324153 -4.969142 -0.170807
C  4.489009 -3.147162 -0.293042
C  3.638166 -5.41472 -0.246361
H  1.495162 -5.662022 -0.125772
C  4.700999 -4.520339 -0.306632
H  5.31281 -2.448418 -0.341805
H  3.840583 -6.476855 -0.259295
H  5.710468 -4.903364 -0.365767
C  -2.708092 -3.189113 -0.123902
C  -3.603091 -2.126976 -0.169801
C  -3.140624 -4.497849 -0.137702
C  -4.964839 -2.333391 -0.229918
C  -4.512131 -4.713012 -0.195621
H  -2.44114 -5.321778 -0.104232
C  -5.407663 -3.650355 -0.241079
H  -5.658378 -1.504571 -0.267162
H  -4.892921 -5.725001 -0.206416
H  -6.468405 -3.85538 -0.286556
C  3.183416 -2.711978 -0.215344
C  -2.79634 -0.917209 -0.14166
C  2.595769 -1.3821 -0.179336
N  -3.328653 0.284225 -0.164979
N  3.325197 -0.289296 -0.209351
N  0.285882 3.321043 -0.056075
C  1.378666 2.592385 -0.089402
C  -0.915483 2.790367 -0.076079
N  -1.242327 1.469579 -0.086288
N  1.474643 1.235894 -0.10041
C  -2.123029 3.600332 -0.115706
C  -2.326398 4.963831 -0.121723
C  -4.493063 3.142423 -0.217566
C  -3.641376 5.409721 -0.173805
H  -1.496752 5.656493 -0.086467
C  -4.705135 4.515596 -0.221197
H  -5.31765 2.443966 -0.256009
H  -3.843923 6.4719 -0.17813
H  -5.715411 4.898878 -0.262002
C  2.70635 3.183994 -0.147123
C  3.600546 2.121889 -0.207375
C  3.138993 4.49262 -0.158368
C  4.961616 2.328299 -0.279883
C  4.510018 4.707821 -0.228564
H  2.440158 5.316549 -0.113263
C  5.404719 3.645279 -0.288406
H  5.654556 1.49953 -0.327868
H  4.890947 5.71978 -0.237356
H  6.465047 3.850279 -0.34283
C  -3.186371 2.70686 -0.162994
C  2.793496 0.912209 -0.175413
C  -2.598646 1.376823 -0.140907
Co 0.000926 -0.002764 0.028033
N  0.038655 -0.00923 2.213013
C  -0.98739 0.049754 3.028603
C  1.153203 -0.081304 3.00958
H  -2.02425 0.114088 2.743127
C  0.782775 -0.064823 4.316898
H  2.146482 -0.139591 2.597202
H  -1.180622 0.052213 5.118068
H  1.352068 -0.104148 5.22738
N  -0.582715 0.01878 4.310431
C  -0.085448 0.060963 -3.623624
O  -1.20589 -0.029354 -3.882508
O  1.035467 0.151963 -3.364835
