program: Gaussian 16
title: co-pc-Im_+1_3_pcm.m6.pc2
version: EM64L-G16RevB.01
method: UM06
basis: Gen
operation: Freq
keyword: #m06/gen
keyword: freq
keyword: scrf=(iefpcm,solvent=water)
keyword: density=current
title: # m06/gen freq scrf=(iefpcm,solvent=water) density=current
converged: YES YES NO NO
elementType: N
elementType: C
elementType: H
elementType: Co
1716.lowfreq: -0.0059 -0.0056 -0.0023 3.4324 5.3319 10.5302 15.3923 17.7490 20.5516
frequency: 15.3434 17.6548 20.5394 35.7085 39.5955 47.6818 64.0058 77.8099 112.0418 113.4219 115.5770 122.4786 124.2281 125.0796 133.8248 137.9701 142.5505 158.9983 191.7077 192.0632 211.9224 217.6423 232.2191 250.1919 251.4846 259.4740 287.2800 288.3276 300.1956 301.8559 302.3713 302.7835 353.0155 353.6063 364.0319 416.7448 416.8588 417.1949 428.7713 444.0490 490.1794 492.4698 492.6582 516.8774 523.4312 523.7629 568.7560 578.3111 578.6498 584.3903 595.9164 600.6131 638.2415 648.8003 648.9983 649.2587 653.5736 668.1572 668.2891 682.4347 691.3133 697.7939 710.1699 720.1964 745.3741 745.9766 754.1531 756.7226 766.0787 766.6445 770.3535 795.9217 800.5782 800.8778 801.5933 806.0769 810.5145 813.4806 814.0714 817.9584 822.2114 822.3549 854.6560 859.3348 865.4904 883.3600 906.3331 907.0946 907.3707 908.0435 920.7359 921.0453 924.9401 942.9223 966.6139 986.4162 986.4437 986.7349 986.7419 1022.6862 1022.7356 1023.2713 1023.3305 1032.7785 1032.8809 1033.2169 1033.4087 1068.0301 1071.5647 1072.9098 1083.9966 1096.6264 1096.7704 1096.9737 1111.8770 1118.0436 1119.6618 1138.6543 1139.0507 1150.4514 1151.4030 1156.6630 1164.5788 1164.7065 1174.6359 1192.7447 1195.3568 1210.4537 1210.5964 1210.8055 1226.0831 1292.0708 1301.7437 1301.9187 1303.4705 1315.9729 1354.5258 1368.4252 1368.7444 1373.3914 1379.1284 1395.2085 1395.4635 1410.7129 1437.0558 1443.5652 1444.3636 1445.9509 1457.2336 1467.3305 1492.2040 1495.8889 1496.4557 1498.1628 1501.1581 1506.4078 1506.5225 1507.1859 1526.7766 1567.8197 1568.0570 1574.2093 1578.7862 1611.9309 1654.8523 1655.0596 1655.3990 1656.7857 1658.1366 1658.7266 1658.8895 1660.4422 3187.2354 3187.2789 3187.2973 3187.3065 3195.7784 3195.7991 3195.8328 3195.8500 3202.9723 3202.9803 3203.0421 3203.0602 3207.5765 3207.5998 3207.6205 3207.7756 3243.4243 3254.5383 3287.2943 3651.2474
redmass: 5.2304 4.0867 5.5554 6.5632 5.8425 5.4029 5.5863 5.3852 5.0730 3.8922 5.0954 5.2539 5.3888 5.2370 7.2763 5.7319 6.5426 4.7726 11.4255 8.1620 6.1991 5.5488 11.5333 6.6880 6.7226 7.5689 10.1925 10.1850 8.7602 7.7076 7.6422 7.6913 20.3382 20.3441 14.2237 3.0858 3.0922 3.0931 3.1911 5.2207 5.5592 4.6107 4.6174 4.1953 7.3191 7.3166 8.1454 8.5473 8.5481 7.8348 1.9195 9.0326 7.8774 8.0667 8.0671 4.5848 1.9051 4.8582 4.8517 2.2921 8.8975 7.0460 5.9779 2.5236 1.8795 1.8872 1.5104 1.2297 9.1186 9.0659 11.9165 1.8993 2.8423 2.8537 6.0015 4.4856 5.0862 4.3074 4.3041 4.0200 6.2085 6.1684 1.4295 7.8104 6.9735 1.3848 1.4400 1.4515 1.4508 1.4594 9.3298 9.3319 5.7648 4.0730 9.8706 1.4047 1.4048 1.4046 1.4045 1.3431 1.3434 1.3425 1.3427 1.9342 1.9494 1.9382 1.9480 6.8042 5.3768 5.1450 1.5537 2.7252 3.8203 4.2396 1.3645 1.6274 3.4931 1.6832 1.6783 1.5504 1.6576 1.1725 1.2393 1.2361 1.9174 4.0015 2.8574 3.2456 3.4700 3.2422 2.7065 1.4011 1.5911 1.5883 1.5988 1.8438 9.8022 8.4075 8.8441 3.8880 8.6461 8.9176 8.9273 5.9630 3.2858 3.7096 3.6472 4.6265 10.2879 3.8320 3.0693 3.2946 3.2207 4.3351 2.8902 4.8368 3.9797 4.1085 3.4309 10.5072 10.3771 3.6716 8.1841 12.5948 7.5966 7.6085 7.6061 7.6205 7.7274 7.7216 7.7240 7.7898 1.0868 1.0868 1.0868 1.0868 1.0899 1.0899 1.0899 1.0899 1.0944 1.0944 1.0944 1.0944 1.0979 1.0979 1.0978 1.0979 1.0941 1.0982 1.1045 1.0833
irintensity: 0.6125 0.3752 3.8775 1.5780 0.6050 0.0636 0.8979 0.0482 5.7984 0.0032 0.0499 3.8954 3.6212 2.2613 2.2906 2.8506 0.0121 1.7967 22.1771 0.7940 0.0171 0.0052 0.0098 0.0345 0.0202 0.0063 0.1965 0.0710 0.0527 3.9581 1.4241 0.6844 0.7682 0.6832 0.1275 0.0062 0.0155 0.0131 19.9008 0.0003 0.0240 0.0073 0.0082 0.0010 8.6847 9.0013 0.0013 14.6584 14.2336 0.0121 114.9345 0.2484 0.0030 0.1557 0.0548 0.4464 50.8843 0.2876 0.2496 0.1947 0.0006 0.0650 0.0025 0.0522 0.4253 0.5954 467.1979 53.4395 8.9546 7.7125 0.0840 0.0435 0.0973 0.0386 0.0012 0.0111 0.0106 0.2779 0.2773 0.0621 3.1432 3.0527 23.2523 0.0016 0.0174 0.0303 0.0020 0.0324 0.0478 0.0004 0.5298 0.7072 6.5192 0.1697 0.0543 2.1971 0.1783 1.1261 0.0578 0.0009 0.0008 0.0018 0.0007 2.0923 0.0084 2.0388 0.0413 0.0970 57.2703 57.1923 82.1579 3.8069 22.2301 28.0250 53.9661 0.1006 0.0143 3.9018 3.2078 14.9969 0.2943 0.0001 29.8554 26.8885 0.1263 8.6044 0.0005 16.0680 0.2763 16.4454 0.0148 7.5455 5.1650 5.3482 0.0003 0.0048 0.0495 1166.9102 1190.0473 50.2099 0.2256 215.7802 212.0981 0.0150 19.4207 2.6830 1.2226 0.9179 0.0052 0.5810 0.0077 214.6996 202.4501 0.8406 0.0027 3.8500 50.1720 63.2170 65.9031 3.1184 1.3462 17.7522 2.0264 0.0167 0.0664 27.4074 29.8541 0.0753 0.1164 56.4524 58.5468 0.1488 1.5200 1.4235 1.8876 1.0861 3.0822 4.4626 5.9938 1.6421 0.9214 16.0338 10.7029 6.0079 67.9866 22.9403 85.6787 0.3504 8.2538 3.8288 0.9325 190.8702
temp: 298.150 k
press: 1.00000 atm
elementType: 7 6 6 7 7 6 6 6 6 1 6 1 1 1 6 6 6 6 6 1 6 1 1 1 6 6 6 7 7 7 6 6 7 7 6 6 6 6 1 6 1 1 1 6 6 6 6 6 1 6 1 1 1 6 6 6 27 7 6 6 1 6 1 1 1 7
symmnumber: 1
zpe: 1280849.7 jmol-1
zpe.correction: 0.487850 hartree
zpe.thermalcorrener: 0.520732 hartree
zpe.thermalcorrenthalpy: 0.521676 hartree
zpe.thermalcorrgfe: 0.421293 hartree
zpe.sumelectzpe: -3274.979537 hartree
zpe.sumelectthermal: -3274.946655 hartree
zpe.sumelectthermalent: -3274.945711 hartree
zpe.sumelectthermalfe: -3275.046094 hartree
dipole: 1.5532 -0.1126 5.0557
dipole: 5.2901
quadrupole: -174.2927 -182.7335 -231.3554
quadrupole: -0.1462 6.3361 -0.6012
quadrupole: 21.8345 13.3937 -35.2282 -0.1462 6.3361 -0.6012
hfenergy: -3275.4673872 hartree
pointgroup: C01 [X(C35H20Co1N10)]
dipole: 0.6110613 -0.0442893 1.9890591 debye
polarizability: 1409.4365704|0.0884371|1387.459923|0.9417629|1.4561608|362.0295062 unknown
InChI: InChI=1S/C32H16N8.C3H4N2.Co/c1-2-10-18-17(9-1)25-33-26(18)38-28-21-13-5-6-14-22(21)30(35-28)40-32-24-16-8-7-15-23(24)31(36-32)39-29-20-12-4-3-11-19(20)27(34-29)37-25;1-2-5-3-4-1;/h1-16H;1-4H;/q-4;-1;+5
charge 1 multiplicity 3
66 atoms
N  0.205926 3.334577 -0.301603
C  1.317775 2.635275 -0.322713
C  -0.980999 2.772736 -0.333164
N  -1.273357 1.444185 -0.348475
N  1.449691 1.281378 -0.334177
C  -2.208885 3.551204 -0.380321
C  -2.446634 4.908909 -0.385493
C  -4.565487 3.033138 -0.496454
C  -3.772239 5.32148 -0.444785
H  -1.634855 5.622141 -0.344245
C  -4.812434 4.400565 -0.499451
H  -5.371866 2.313984 -0.540183
H  -4.00187 6.378134 -0.448962
H  -5.832044 4.757713 -0.545439
C  2.629806 3.262079 -0.362364
C  3.552604 2.224206 -0.411403
C  3.028392 4.581682 -0.365795
C  4.908591 2.46614 -0.464986
C  4.394087 4.832788 -0.41689
H  2.307537 5.386883 -0.329038
C  5.317218 3.794208 -0.465859
H  5.623363 1.655635 -0.504426
H  4.748164 5.854507 -0.419124
H  6.372406 4.027162 -0.505538
C  -3.248488 2.630684 -0.435135
C  2.778419 0.993239 -0.391281
C  -2.625918 1.316368 -0.411035
N  3.342459 -0.193285 -0.419241
N  -3.327053 0.204985 -0.438957
N  -0.191537 -3.32361 -0.324357
C  -1.30349 -2.62446 -0.351161
C  0.995532 -2.761651 -0.344545
N  1.288236 -1.432845 -0.349458
N  -1.435199 -1.270872 -0.363319
C  2.223685 -3.539837 -0.387272
C  2.46145 -4.897538 -0.398221
C  4.581175 -3.021377 -0.482449
C  3.787422 -5.30989 -0.449656
H  1.649357 -5.610927 -0.367093
C  4.828066 -4.388773 -0.491277
H  5.387909 -2.302072 -0.515974
H  4.017026 -6.366524 -0.457911
H  5.847978 -4.745755 -0.531504
C  -2.615633 -3.251023 -0.394044
C  -3.538141 -2.212743 -0.441803
C  -3.014644 -4.570456 -0.399589
C  -4.894154 -2.45418 -0.496074
C  -4.380427 -4.821068 -0.451804
H  -2.294097 -5.375966 -0.363492
C  -5.3032 -3.782153 -0.499402
H  -5.608677 -1.643387 -0.534047
H  -4.734807 -5.842677 -0.455776
H  -6.358451 -4.014704 -0.539748
C  3.263766 -2.619115 -0.428849
C  -2.76342 -0.982029 -0.41816
C  2.641228 -1.304877 -0.401367
Co 0.006365 0.004668 -0.231759
N  -0.037506 -0.021105 1.959621
C  0.9907 -0.050177 2.7739
C  -1.153596 -0.023593 2.757394
H  2.029475 -0.056899 2.487779
C  -0.781808 -0.054327 4.064033
H  -2.149172 -0.003908 2.346636
H  1.18584 -0.094825 4.862733
H  -1.351858 -0.065672 4.974818
N  0.586177 -0.070763 4.05609
