program: Gaussian 16
title: co-pc_+1_3_pcm.m6.pc2
version: EM64L-G16RevB.01
method: UM06
basis: Gen
operation: Freq
keyword: #m06/gen
keyword: freq
keyword: scrf=(iefpcm,solvent=water)
keyword: density=current
title: # m06/gen freq scrf=(iefpcm,solvent=water) density=current
converged: YES YES NO NO
elementType: N
elementType: C
elementType: H
1716.lowfreq: -6.3115 -0.0034 -0.0020 0.0030 10.5779 10.5781 15.5849 38.8839 43.4022
frequency: 15.5849 38.8839 43.4022 64.9063 64.9071 111.9278 113.5966 121.0577 121.0579 121.6603 121.6615 139.0681 168.6273 198.9457 210.7972 215.1780 235.6602 248.3846 248.3856 261.6355 280.2710 280.2720 295.7007 300.5444 303.0463 303.0465 356.3918 356.3930 368.3105 415.9436 416.3195 416.3208 428.6018 439.2124 489.6327 490.3052 490.3067 514.1074 525.0383 525.0386 571.5349 579.4994 579.4995 583.8807 602.1792 639.5820 643.7851 650.4922 650.4924 666.4096 666.4099 691.0549 697.2818 709.4005 719.0543 745.8426 745.8434 754.7247 767.6191 767.6192 770.9854 795.0504 798.5994 798.5998 800.1294 805.3738 808.0318 813.6985 813.6987 819.0394 824.3851 824.3863 863.2321 866.9098 905.9916 906.9946 906.9972 907.3521 922.9419 922.9421 967.6673 987.1227 987.1628 987.1635 987.1646 1023.2858 1023.2920 1023.2996 1023.3006 1031.9642 1031.9661 1032.0176 1032.2479 1068.6877 1074.2975 1074.2985 1096.3345 1097.7011 1097.7015 1116.0735 1116.9205 1139.1222 1139.1228 1151.8114 1156.3489 1164.8831 1164.8840 1176.2039 1197.7743 1212.9667 1212.9734 1212.9866 1222.2861 1301.7965 1301.7981 1303.5496 1315.1613 1357.0452 1370.3098 1370.3120 1379.9356 1397.1415 1397.1442 1410.5196 1445.6414 1445.6428 1446.0222 1463.7833 1467.0048 1491.7366 1497.0826 1497.0832 1499.0037 1501.3093 1508.2920 1508.2926 1510.0642 1570.7874 1570.7878 1582.7578 1619.8887 1653.0374 1653.3801 1653.3846 1654.7000 1658.0523 1658.5968 1658.5971 1660.2641 3189.1583 3189.1619 3189.1637 3189.1690 3196.6236 3196.6316 3196.6361 3196.6573 3203.3507 3203.3628 3203.3657 3203.3785 3208.8158 3208.8184 3208.8196 3208.9784
redmass: 6.1739 6.9013 5.4069 5.4899 5.4899 3.9027 5.0556 5.3403 5.3404 4.9859 4.9859 6.5911 10.2474 8.0262 6.1504 5.5368 11.5170 6.6235 6.6235 7.5426 10.5506 10.5506 8.7712 7.7743 7.5642 7.5642 19.7819 19.7818 13.6192 3.0915 3.1022 3.1022 3.2327 5.2578 5.5935 4.5971 4.5972 4.1910 7.4195 7.4196 8.1428 8.5417 8.5417 7.8356 9.0417 7.9041 4.6318 8.0696 8.0696 4.9599 4.9599 8.8681 7.0344 5.9466 2.5868 1.8876 1.8877 1.4955 9.2850 9.2850 11.8629 1.8587 2.9077 2.9077 4.6452 6.1691 5.2677 4.1745 4.1746 4.1370 6.2392 6.2392 7.7911 6.9873 1.4269 1.4396 1.4396 1.4372 9.3367 9.3367 9.8276 1.4016 1.4016 1.4017 1.4017 1.3436 1.3434 1.3434 1.3434 1.9258 1.9258 1.9443 1.9338 6.9487 5.1224 5.1220 2.7003 3.9541 3.9542 1.6452 3.2090 1.7022 1.7022 1.5639 1.1679 1.2516 1.2516 2.0741 2.8642 3.3577 3.2359 3.3969 2.6579 1.6065 1.6065 1.6156 1.8374 9.8038 8.7501 8.7504 8.7583 9.1339 9.1338 5.9673 3.5313 3.5312 4.8160 10.1509 3.6979 3.0758 3.1610 3.1611 3.5350 2.9069 4.3783 4.3782 6.6243 10.6414 10.6413 9.3285 12.5583 7.6081 7.6194 7.6195 7.6205 7.8003 7.7760 7.7762 7.8412 1.0868 1.0868 1.0868 1.0868 1.0897 1.0897 1.0897 1.0897 1.0944 1.0944 1.0944 1.0944 1.0980 1.0980 1.0980 1.0980
irintensity: 0.0000 2.0817 0.0000 0.0000 0.0000 0.0001 0.0000 4.3967 4.3969 0.0028 0.0028 0.0000 14.3939 0.0000 0.0000 0.0000 0.0000 0.0000 0.0000 0.0000 0.0000 0.0000 0.0000 3.4081 0.1065 0.1065 1.6159 1.6163 0.2711 0.0000 0.0000 0.0000 21.6206 0.0087 0.0000 0.0000 0.0000 0.0000 7.9853 7.9858 0.0000 14.3626 14.3629 0.0000 0.0000 0.0000 0.0040 0.0643 0.0642 0.0000 0.0000 0.0000 0.0000 0.0000 0.0000 0.0000 0.0000 461.3553 9.4792 9.4789 0.0000 0.0000 0.0000 0.0000 0.0001 0.0000 0.0000 0.0000 0.0000 0.1076 2.7883 2.7879 0.0000 0.0000 0.0000 0.0000 0.0000 0.0018 0.0067 0.0068 0.0000 0.0003 2.8548 0.4236 0.2312 0.0000 0.0000 0.0000 0.0000 1.5116 1.5136 0.0086 0.0002 0.0000 29.1744 29.1677 0.0008 17.7364 17.7375 0.0000 0.0004 4.0155 4.0103 0.0000 0.0000 24.5743 24.5711 0.0000 0.0000 13.2265 23.2694 10.0862 0.0001 11.8110 11.8075 0.0002 0.0001 0.0004 1218.1890 1218.2018 0.0001 254.3487 254.3334 0.0002 4.9276 4.9243 0.0003 0.0009 0.0000 0.0001 197.5194 197.5238 0.0048 0.0019 86.4778 86.4773 0.0078 0.0043 0.0042 0.0001 0.0011 0.0360 27.0377 27.0787 0.0026 0.0634 61.5300 61.4639 0.0071 0.1774 1.2596 1.0790 0.1085 0.0403 1.7464 1.7834 0.0022 0.4115 16.9453 16.1960 0.6286 75.0206 18.6266 82.3264 0.0011
temp: 298.150 k
press: 1.00000 atm
elementType: 7 6 6 7 7 6 6 6 6 1 6 1 1 1 6 6 6 6 6 1 6 1 1 1 6 6 6 7 7 7 6 6 7 7 6 6 6 6 1 6 1 1 1 6 6 6 6 6 1 6 1 1 1 6 6 6 27
symmnumber: 1
zpe: 1089622.8 jmol-1
zpe.correction: 0.415015 hartree
zpe.thermalcorrener: 0.442516 hartree
zpe.thermalcorrenthalpy: 0.443460 hartree
zpe.thermalcorrgfe: 0.356963 hartree
zpe.sumelectzpe: -3048.864479 hartree
zpe.sumelectthermal: -3048.836978 hartree
zpe.sumelectthermalent: -3048.836034 hartree
zpe.sumelectthermalfe: -3048.922531 hartree
dipole: -0.0000 0.0000 0.0001
dipole: 0.0001
quadrupole: -144.8038 -144.8035 -238.5136
quadrupole: -0.0000 0.0031 0.0017
quadrupole: 31.2365 31.2368 -62.4733 -0.0000 0.0031 0.0017
hfenergy: -3049.2794939 hartree
pointgroup: C01 [X(C32H16Co1N8)]
dipole: -0.0000185 -0.0000007 -0.0000434 debye
polarizability: 1354.7402665|-0.0035401|1354.7439267|-0.030117|0.0260674|271.2117164 unknown
InChI: InChI=1S/C32H16N8.Co/c1-2-10-18-17(9-1)25-33-26(18)38-28-21-13-5-6-14-22(21)30(35-28)40-32-24-16-8-7-15-23(24)31(36-32)39-29-20-12-4-3-11-19(20)27(34-29)37-25;/h1-16H;/q-4;+4
charge 1 multiplicity 3
57 atoms
N  2.268406 2.449011 -0.000348
C  0.994914 2.764818 -0.000413
C  2.680587 1.203302 0.000003
N  1.918614 0.07339 -0.00002
N  -0.073402 1.91859 0.00007
C  4.089913 0.851598 0.00055
C  5.235881 1.618275 0.000812
C  5.344565 -1.212923 0.001274
C  6.449831 0.943147 0.001314
H  5.190346 2.698557 0.000613
C  6.503184 -0.446663 0.001544
H  5.382036 -2.29352 0.00143
H  7.372813 1.506425 0.00153
H  7.466628 -0.937541 0.001936
C  0.536408 4.143155 -0.000884
C  -0.851596 4.0899 -0.000549
C  1.212879 5.344568 -0.001477
C  -1.618302 5.235827 -0.000785
C  0.44658 6.503186 -0.001736
H  2.293474 5.382132 -0.00172
C  -0.943209 6.449812 -0.001392
H  -2.698583 5.190259 -0.000495
H  0.937476 7.46662 -0.002207
H  -1.506532 7.372767 -0.001598
C  4.14316 -0.536401 0.000775
C  -1.203268 2.680548 0.000054
C  2.76483 -0.994875 0.000306
N  -2.44899 2.268386 0.000516
N  2.449005 -2.26841 0.000173
N  -2.268392 -2.448986 -0.000336
C  -0.994846 -2.764788 -0.000516
C  -2.680536 -1.203308 0.000129
N  -1.918571 -0.073388 0.00008
N  0.073374 -1.91859 -0.000106
C  -4.089898 -0.851599 0.000783
C  -5.235838 -1.618263 0.001028
C  -5.344522 1.212911 0.001749
C  -6.44982 -0.943132 0.001666
H  -5.190354 -2.698547 0.000725
C  -6.503172 0.446644 0.002025
H  -5.382045 2.293508 0.002007
H  -7.372767 -1.506466 0.00188
H  -7.466587 0.937578 0.002519
C  -0.536399 -4.143147 -0.000989
C  0.851605 -4.089906 -0.000754
C  -1.212952 -5.344513 -0.001546
C  1.618233 -5.235885 -0.001063
C  -0.446722 -6.503169 -0.001884
H  -2.293551 -5.381953 -0.001718
C  0.943068 -6.449837 -0.001643
H  2.69852 -5.190442 -0.000857
H  -0.937645 -7.46659 -0.002341
H  1.506366 -7.372807 -0.00191
C  -4.143145 0.536402 0.001132
C  1.203339 -2.680571 -0.000196
C  -2.76478 0.994886 0.000614
Co 0.00001 0.000001 0.000015
