program: Gaussian 09
title: 000044686
version: EM64L-G09RevD.01
frameworkgroup: C1[X(C22H27NO2)]
method: RPBEPBE
basis: SDD
operation: Freq
keyword: #p
keyword: freq=noraman
keyword: PBEPBE/SDD
title: #p freq=noraman PBEPBE/SDD
converged: YES YES NO NO
title: Mulliken charges:
elementType: O O N C C C C C C C C C C C C C C C C C C C C C C H H H H H H H H H H H H H H H H H H H H H H H H H H H
charge: -0.244525 -0.206974 -0.088406 0.047134 -0.505951 -0.389684 0.409670 0.335078 0.124786 -0.340030 -0.348328 -0.327781 -0.320904 -0.489889 -0.385447 -0.346886 -0.368445 -0.417906 -0.691084 -0.249373 -0.247238 -0.267107 -0.249964 -0.246214 -0.244206 0.214390 0.243997 0.243281 0.181131 0.201770 0.191420 0.189943 0.216777 0.192058 0.214525 0.215077 0.193025 0.252761 0.236030 0.252558 0.274775 0.255167 0.257423 0.234575 0.227663 0.210157 0.223470 0.229348 0.224841 0.226181 0.227074 0.230256
chargesum: 0.00000
title: Mulliken charges with hydrogens summed into heavy atoms:
elementType: O O N C C C C C C C C C C C C C C C C C C C C C C
charge: -0.244525 -0.206974 -0.088406 0.047134 -0.047564 0.034728 0.409670 0.335078 0.124786 0.053160 0.058392 0.078803 0.087199 -0.001099 -0.132889 -0.072111 -0.113279 -0.160483 -0.018689 -0.025903 -0.017890 -0.042266 -0.023783 -0.019140 -0.013950
polarizability: 2.54962160e+02 -6.68657938e+00 2.56211179e+02 -1.50636959e+01 1.79891684e+01 2.17001780e+02
1716.lowfreq: -4.2172 -0.2087 0.0004 0.0004 0.0005 7.6297 27.9660 30.4845 34.2897
frequency: 27.8152 30.4130 34.1757 40.8783 50.8067 53.5148 66.4264 85.4147 95.0290 103.5195 140.4525 145.3613 188.5906 193.5219 219.1923 236.0133 241.1272 248.8701 270.9041 279.3256 304.3692 314.0241 328.1571 354.3063 392.0133 402.8319 406.4186 416.1659 429.6867 471.4201 477.8625 491.4384 536.9832 589.3393 608.2940 615.2191 617.1182 628.1516 647.6305 701.1796 707.0289 707.6105 752.9854 764.2382 769.0550 781.2811 802.2495 812.8953 839.9901 848.2599 852.1241 860.5716 881.4939 899.8333 925.0974 932.3797 976.5549 980.6792 984.8446 990.0458 990.8612 993.5248 1000.1312 1000.8365 1015.7090 1027.0757 1027.8387 1029.8759 1048.2187 1053.7866 1061.5715 1068.8114 1078.2470 1088.6674 1089.9652 1100.4362 1102.5184 1120.4010 1134.9734 1141.6148 1168.8923 1172.7368 1174.4115 1189.7864 1197.3988 1199.6953 1202.2915 1236.0195 1247.0225 1263.0443 1273.5894 1289.5035 1300.9086 1305.5523 1324.0003 1325.1726 1327.7860 1330.9552 1345.6950 1358.9547 1371.2490 1372.9227 1378.2877 1391.9873 1392.7187 1431.4430 1434.1906 1434.8553 1443.7053 1446.9610 1451.9707 1459.2354 1467.9489 1468.4856 1478.4647 1479.2788 1482.3232 1486.1531 1585.9102 1588.6849 1604.0223 1608.3474 1614.6901 2833.5594 2853.6765 2871.4961 2953.6359 2958.4068 2969.8933 2996.5785 3003.3961 3025.0059 3027.8401 3031.6272 3040.4553 3065.0480 3080.6471 3084.0066 3091.9253 3102.6027 3119.8022 3124.0745 3128.5030 3130.9648 3141.2133 3143.8890 3155.7236 3157.8478 3166.8132 3179.0363
redmass: 4.4383 3.0917 4.4042 3.7983 3.9768 4.0939 4.6253 3.5268 2.8532 3.5337 3.6106 2.6737 2.1051 2.3841 2.9325 2.5305 3.2092 2.5928 4.0304 4.5364 4.3134 2.3298 2.9096 4.0503 2.1752 2.8447 2.8420 3.3139 4.9059 2.7858 3.4091 3.9522 2.7411 2.1640 4.5156 5.6370 6.3155 2.9847 4.4353 2.8050 1.7102 1.9848 1.9993 2.7778 1.6178 2.1884 2.3000 2.3749 1.6689 1.8908 1.2501 1.2875 3.4151 2.3106 1.4834 1.4820 1.4563 2.2157 1.3943 5.9379 2.9836 1.6992 1.3971 2.4978 1.8072 2.1811 2.3699 2.2972 3.3647 2.1113 1.9304 2.2094 2.2023 3.0196 1.7665 2.1859 2.2751 2.5621 2.6746 2.5417 3.6734 1.0510 1.0635 1.0677 1.4440 1.1591 1.3988 1.6364 1.2026 1.3458 1.3687 1.3080 1.2750 1.2510 1.4364 1.4029 1.5159 1.2729 1.2711 1.4162 1.2784 5.9421 6.4977 1.4125 1.2339 1.7704 2.0341 1.3282 1.0821 1.0792 1.0968 1.0941 1.0549 1.1093 1.0513 1.3667 2.0351 1.4981 5.8513 6.0140 6.4119 6.2295 7.6527 1.0712 1.0701 1.0691 1.0666 1.0665 1.0617 1.0362 1.0593 1.0953 1.0877 1.0908 1.0882 1.1002 1.0961 1.0979 1.1004 1.0998 1.0848 1.0848 1.0882 1.0882 1.0938 1.0933 1.0947 1.0990 1.1001 1.0951
irintensity: 0.3615 0.2112 0.2566 0.8570 0.0219 0.1731 0.2882 0.7320 0.9263 1.8684 1.9056 0.9889 0.1804 0.1651 2.6950 3.3876 0.8914 2.9618 2.1607 0.2175 3.0020 7.9295 4.4919 3.5620 2.2891 0.1379 0.0568 6.6023 3.0747 1.3877 2.0689 5.3926 5.8668 2.1153 11.8251 2.4037 0.1843 22.3693 4.4674 13.3847 64.9295 36.8095 13.0967 26.3491 33.2688 5.4453 15.4396 21.5691 0.1701 4.0925 0.2904 2.2787 2.3056 7.2002 0.3722 1.1009 5.1242 42.9005 0.8421 0.7096 0.4104 0.3126 2.7751 32.0276 13.0953 10.8333 3.4232 16.6415 7.6224 20.0986 1.1727 5.1769 5.9989 32.3483 1.3881 17.0709 20.2005 31.1334 68.2565 11.0096 0.2937 0.0066 0.0500 1.6155 5.3837 0.9167 0.5770 13.0116 4.5600 8.0928 11.2760 2.1378 3.1689 17.9233 5.9717 6.4828 16.5199 6.1375 14.6319 2.4368 2.6614 0.9574 0.6112 4.8674 21.2261 26.4610 6.6499 2.1695 2.4533 0.6922 21.3448 4.3917 18.4722 4.8598 10.8967 19.0700 28.7763 6.6535 1.7036 2.4436 35.3873 8.9963 56.3058 68.7184 68.4661 115.6490 34.1453 95.4192 22.4412 31.7727 17.2864 7.6204 52.5872 27.7507 4.4829 46.1819 38.6125 36.4564 29.0645 24.4618 1.7118 1.2392 3.8140 4.3309 29.2166 16.8689 31.1797 36.6744 19.2937 6.3907
temp: 298.150 k
press: 1.00000 atm
elementType: 8 8 7 6 6 6 6 6 6 6 6 6 6 6 6 6 6 6 6 6 6 6 6 6 6 1 1 1 1 1 1 1 1 1 1 1 1 1 1 1 1 1 1 1 1 1 1 1 1 1 1 1
symmnumber: 1
zpe: 1150048.9 jmol-1
zpe.correction: 0.438031 hartree
zpe.thermalcorrener: 0.461778 hartree
zpe.thermalcorrenthalpy: 0.462722 hartree
zpe.thermalcorrgfe: 0.383086 hartree
zpe.sumelectzpe: -1057.843676 hartree
zpe.sumelectthermal: -1057.819928 hartree
zpe.sumelectthermalent: -1057.818984 hartree
zpe.sumelectthermalfe: -1057.898620 hartree
dipole: 0.4240 -0.8222 -1.9400
dipole: 2.1493
quadrupole: -162.6709 -137.2534 -151.2212
quadrupole: -6.3049 -7.5651 1.6378
quadrupole: -12.2891 13.1285 -0.8394 -6.3049 -7.5651 1.6378
hfenergy: -1058.2817062 hartree
pointgroup: C01 [X(C22H27N1O2)]
dipole: -0.161911 0.3843 -0.7356115 debye
polarizability: 254.7493488|-7.7997267|259.1024129|13.8264932|-15.1708081|214.3233576 unknown
InChI: InChI=1S/C22H27NO2/c1-2-21(24)22(19-9-5-3-6-10-19,20-11-7-4-8-12-20)13-14-23-15-17-25-18-16-23/h3-12H,2,13-18H2,1H3
charge 0 multiplicity 1
52 atoms
O  5.933529 0.575683 -0.42923
O  -1.375046 0.037134 2.612653
N  3.093798 -0.062295 -0.416634
C  -0.764766 0.086099 0.211318
C  0.621042 0.331041 -0.472976
C  1.784726 -0.473748 0.145618
C  -1.094491 -1.424253 0.106111
C  -1.892146 0.930865 -0.455956
C  -0.766293 0.631102 1.685015
C  3.605719 1.206042 0.163078
C  4.128328 -1.124936 -0.300176
C  4.90712 1.624091 -0.541289
C  5.419445 -0.678923 -1.00545
C  -0.087302 1.982756 1.940066
C  -1.654705 -1.917025 -1.1019
C  -3.216904 0.799843 0.043077
C  -0.749766 -2.361055 1.114644
C  -1.660063 1.831194 -1.525369
C  -0.476556 2.60758 3.2918
C  -1.872614 -3.29805 -1.297764
C  -4.277046 1.544808 -0.51206
C  -0.9732 -3.743398 0.923626
C  -2.723784 2.577275 -2.085743
C  -1.534797 -4.221011 -0.281832
C  -4.035528 2.440194 -1.581334
H  0.864722 1.408591 -0.447633
H  0.544881 0.049905 -1.539384
H  1.637674 -1.545232 -0.077831
H  1.773033 -0.381267 1.263543
H  2.854529 2.007191 0.031394
H  3.802462 1.096632 1.260875
H  4.361279 -1.357714 0.769675
H  3.747813 -2.047933 -0.776568
H  4.697226 1.830625 -1.61317
H  5.346572 2.518413 -0.069117
H  6.225296 -1.418675 -0.868081
H  5.219868 -0.538305 -2.089696
H  -0.332743 2.666701 1.10432
H  1.01143 1.830602 1.895381
H  -1.931179 -1.211733 -1.894147
H  -3.409176 0.104881 0.868611
H  -0.330814 -2.016634 2.063053
H  -0.655935 1.951661 -1.942917
H  -0.237218 1.926614 4.125666
H  -1.561626 2.805623 3.334234
H  0.05983 3.560888 3.446192
H  -2.308855 -3.650951 -2.239265
H  -5.290306 1.42758 -0.111811
H  -0.710322 -4.446635 1.722157
H  -2.524725 3.262026 -2.91807
H  -1.709492 -5.293232 -0.425945
H  -4.858224 3.019564 -2.01496
