program: Gaussian 09
title: 000005209
version: EM64L-G09RevD.01
frameworkgroup: C1[X(C18H19NO)]
method: RPBEPBE
basis: SDD
operation: Freq
keyword: #p
keyword: freq=noraman
keyword: PBEPBE/SDD
title: #p freq=noraman PBEPBE/SDD
converged: YES YES NO NO
title: Mulliken charges:
elementType: O N C C C C C C C C C C C C C C C C C C H H H H H H H H H H H H H H H H H H H
charge: -0.434927 -0.483229 0.050066 0.208645 0.313035 0.178533 0.193901 -0.646871 -0.085911 -0.592990 0.379362 -0.396871 -0.384734 -0.322175 -0.889501 -0.258222 -0.219727 0.344590 -0.785644 -0.790079 0.327846 0.239026 0.263497 0.220590 0.229167 0.230601 0.245786 0.231445 0.227856 0.251431 0.219048 0.219222 0.371364 0.233202 0.221284 0.213887 0.232803 0.216032 0.228666
chargesum: 0.00000
title: Mulliken charges with hydrogens summed into heavy atoms:
elementType: O N C C C C C C C C C C C C C C C C C C
charge: -0.063563 -0.155383 0.050066 0.208645 0.313035 0.178533 0.193901 -0.407846 -0.085911 -0.108904 0.379362 -0.167704 -0.154133 -0.076389 -0.178769 -0.039174 -0.000505 0.344590 -0.117271 -0.112578
polarizability: 2.58846532e+02 -2.11015035e+01 2.89712073e+02 8.25822830e+00 6.04582788e+00 1.10582244e+02
1716.lowfreq: -7.8028 -0.0004 0.0004 0.0004 1.6132 4.3997 23.7859 35.2374 57.8721
frequency: 23.6414 35.2224 57.8652 82.5452 100.3249 110.5536 134.4410 149.8390 172.5216 181.2696 194.0132 213.0057 243.3198 259.0562 270.9479 286.3281 307.6673 352.0901 361.4310 370.5831 386.6473 417.7587 447.3129 448.1534 469.1848 503.6174 540.1660 566.5583 577.4688 581.2017 598.5513 624.4799 650.0198 664.9190 739.2058 747.7766 754.5633 779.7308 783.4144 820.5146 852.4021 855.1753 865.7321 881.9915 923.4777 930.4699 941.0478 947.9978 967.9216 981.7750 999.0565 1013.4457 1019.8577 1042.8567 1054.6760 1080.2993 1102.7118 1117.1741 1147.8817 1164.1270 1169.0269 1198.8423 1212.7686 1237.9100 1240.9013 1257.3774 1275.6850 1302.4576 1336.5367 1348.0335 1356.8777 1385.7585 1388.5271 1395.3232 1399.1141 1415.7606 1443.7568 1452.5505 1455.6542 1459.3196 1468.0632 1471.2362 1471.8968 1475.4631 1478.0155 1483.7666 1507.2027 1587.2096 1605.8809 1623.4359 1645.3425 1682.2596 2943.7691 2957.9389 2964.8886 2980.7803 3008.8455 3028.6248 3032.5847 3035.2902 3079.3896 3081.9138 3084.9195 3093.1709 3122.3948 3130.0381 3132.6392 3143.8750 3161.7089 3562.8401 3586.7552
redmass: 2.8627 3.5896 3.3666 5.2273 3.1062 1.1187 3.3469 2.7096 1.1245 1.4200 3.4324 2.6566 2.5398 1.7935 2.1860 2.4164 3.2584 5.4624 5.2882 4.4407 2.7822 3.4930 3.1261 2.8462 3.0376 4.7517 3.5553 4.0039 3.4664 1.2991 3.8920 3.9984 5.4375 5.7501 2.7546 1.8285 3.7392 3.6313 2.7448 4.8112 1.4621 1.8503 3.0482 1.4816 3.5192 1.4011 2.0255 1.5329 1.3046 1.7679 1.2610 2.0951 2.0958 1.4905 2.4291 1.6600 2.0919 2.3286 2.3724 1.3295 1.2050 1.5981 1.9679 1.4773 1.6077 2.3406 2.7892 1.6627 2.0407 3.9317 1.4719 4.3941 1.2817 1.2399 1.2279 2.7430 2.9812 1.4807 1.2086 1.5835 1.0688 1.5399 1.1233 1.0862 1.0452 3.4968 2.4278 6.5732 7.7573 7.0638 7.8924 6.3328 1.0404 1.0376 1.0387 1.0616 1.0979 1.0969 1.0964 1.0959 1.0952 1.0935 1.0922 1.0959 1.0847 1.0895 1.0916 1.0951 1.1002 1.0805 1.0654
irintensity: 0.1868 0.1395 0.5929 1.1169 0.0542 0.6040 1.3326 3.4093 0.8721 0.2291 1.0880 10.3765 19.6946 52.4124 32.8886 3.9752 0.4510 3.2804 4.9442 3.0243 1.6634 2.0955 7.4065 14.5184 2.2355 2.9714 4.1017 15.3885 5.6392 60.2153 7.1250 2.6341 3.8071 2.4173 22.9279 63.6013 11.3892 14.4757 7.8864 6.0408 0.1729 4.6668 29.2739 15.3157 13.0359 2.5488 30.8164 10.3277 0.0107 2.7789 7.6058 10.2790 7.1923 5.9994 34.8458 4.4681 10.7836 14.3633 71.1994 78.6533 14.8424 68.7554 72.3931 14.9302 19.7894 9.6814 4.4688 9.8812 133.0741 8.4190 6.4687 39.0113 29.9452 6.3837 11.3360 28.8485 12.6959 11.1964 4.6938 6.4085 17.8508 74.8444 5.0357 9.9768 14.2116 24.6369 10.6069 1.1609 10.0448 60.4922 37.4992 4.5139 67.6856 35.7952 50.0452 24.7214 25.8935 9.9650 39.9535 2.3200 6.3044 11.9571 38.3696 35.1251 0.7757 5.0217 9.2559 36.3337 38.9925 140.0772 52.7336
temp: 298.150 k
press: 1.00000 atm
elementType: 8 7 6 6 6 6 6 6 6 6 6 6 6 6 6 6 6 6 6 6 1 1 1 1 1 1 1 1 1 1 1 1 1 1 1 1 1 1 1
symmnumber: 1
zpe: 838954.9 jmol-1
zpe.correction: 0.319541 hartree
zpe.thermalcorrener: 0.338599 hartree
zpe.thermalcorrenthalpy: 0.339543 hartree
zpe.thermalcorrgfe: 0.272048 hartree
zpe.sumelectzpe: -825.882802 hartree
zpe.sumelectthermal: -825.863744 hartree
zpe.sumelectthermalent: -825.862800 hartree
zpe.sumelectthermalfe: -825.930295 hartree
dipole: -1.4154 0.5347 0.0689
dipole: 1.5146
quadrupole: -113.3456 -96.0218 -123.4771
quadrupole: 8.5581 1.6490 1.8477
quadrupole: -2.3974 14.9264 -12.5289 8.5581 1.6490 1.8477
hfenergy: -826.2023426 hartree
pointgroup: C01 [X(C18H19N1O1)]
dipole: 0.5931465 0.0491129 0.0292682 debye
polarizability: 269.7676451|25.266126|276.4224877|22.288666|5.0463158|112.9507157 unknown
InChI: InChI=1S/C18H19NO/c1-11(2)8-9-14-17-15(10-12(3)18(14)20)13-6-4-5-7-16(13)19-17/h4-8,10,19-20H,9H2,1-3H3
charge 0 multiplicity 1
39 atoms
O  2.778876 2.763613 0.428765
N  -0.324931 -1.045264 0.013295
C  0.081152 0.29943 0.049087
C  -1.078219 1.12935 -0.120544
C  1.384279 0.817936 0.236422
C  -2.221969 0.236336 -0.272187
C  -1.713064 -1.108968 -0.191922
C  -0.923315 2.533482 -0.109783
C  1.481192 2.229766 0.234927
C  2.603363 -0.068181 0.473362
C  0.355302 3.102221 0.064202
C  -3.607868 0.439508 -0.469978
C  -2.55475 -2.23437 -0.309475
C  2.705225 -1.249126 -0.47979
C  0.55499 4.60892 0.081523
C  -4.457111 -0.682493 -0.587697
C  -3.934272 -2.003817 -0.509144
C  2.958501 -2.557347 -0.174434
C  3.088389 -3.599963 -1.275418
C  3.165302 -3.094879 1.232412
H  0.32951 -1.827635 0.003898
H  -1.791432 3.190722 -0.23505
H  3.503605 0.565478 0.366422
H  2.602734 -0.417029 1.525015
H  -4.020421 1.452918 -0.532915
H  -2.159413 -3.254238 -0.247035
H  2.592917 -0.985175 -1.542859
H  0.968904 4.971265 1.045385
H  1.226851 4.959022 -0.730021
H  -0.407978 5.125984 -0.063191
H  -5.532159 -0.538016 -0.741347
H  -4.61394 -2.858324 -0.603891
H  2.757321 3.750455 0.373491
H  2.928564 -3.162998 -2.276171
H  4.094498 -4.0647 -1.261554
H  2.36065 -4.424812 -1.137433
H  2.969287 -2.348171 2.018884
H  2.512819 -3.970823 1.419154
H  4.207716 -3.449075 1.359897
