program: Gaussian 09
title: 000044659
version: EM64L-G09RevD.01
frameworkgroup: C1[X(C5H13N3O3S2)]
method: RPBEPBE
basis: SDD
operation: Freq
keyword: #p
keyword: freq=noraman
keyword: PBEPBE/SDD
title: #p freq=noraman PBEPBE/SDD
converged: YES YES NO NO
title: Mulliken charges:
elementType: S S O O O N N N C C C C C H H H H H H H H H H H H H
charge: -0.323812 0.865482 -0.558099 -0.584195 -0.538794 -0.043190 -0.608715 -0.536914 0.225765 -0.464741 -0.736466 -0.674512 0.275075 0.309754 0.222792 0.244794 0.228304 0.297417 0.270932 0.198283 0.216161 0.354789 0.336091 0.332275 0.323282 0.368241
chargesum: 0.00000
title: Mulliken charges with hydrogens summed into heavy atoms:
elementType: S S O O O N N N C C C C C
charge: -0.323812 0.865482 -0.189858 -0.584195 -0.538794 -0.043190 0.082165 0.118643 0.225765 0.067805 0.034050 0.010864 0.275075
polarizability: 1.53761117e+02 -9.44133636e+00 1.54809544e+02 -7.05857850e+00 -1.38176648e+00 1.08668851e+02
1716.lowfreq: -9.0597 0.0019 0.0022 0.0026 3.2881 8.6189 29.5557 40.8789 51.9755
frequency: 29.0934 40.6999 51.9296 63.8471 84.7899 86.9288 101.7189 109.4942 117.8775 136.4618 138.8891 169.3862 194.8244 217.8311 226.4894 231.8160 281.1458 283.9722 326.2398 363.0110 398.5091 429.6637 445.5576 451.0283 517.6574 535.8118 545.5361 572.6167 605.2385 679.2018 720.8413 764.4254 806.4570 863.4513 906.0797 909.4837 979.7010 1003.5064 1031.3972 1053.8204 1066.4447 1070.9453 1108.2177 1127.0347 1204.5201 1268.6595 1368.4822 1394.7980 1396.4429 1427.1146 1434.6026 1462.3356 1469.2315 1483.2228 1501.1781 1549.2961 1627.5509 1652.9139 1713.4805 2883.6536 2910.9020 2925.0737 2987.7604 2992.9356 3049.5141 3087.2746 3099.7049 3112.5008 3459.5865 3553.2759 3569.9554 3700.4000
redmass: 7.0307 11.2597 7.2099 3.1469 2.2364 4.1415 2.5966 2.7388 4.4068 1.6992 1.6264 2.5634 5.3477 3.0522 3.2290 1.3102 10.7909 18.5692 8.6277 1.1896 2.1673 13.6124 2.4529 2.3478 1.3499 18.9377 2.0348 1.6149 2.4506 7.9022 3.7346 1.3418 9.0453 1.3551 2.1081 3.7914 1.3688 1.4405 2.5308 1.3697 2.0339 1.2081 1.7502 2.1838 2.1182 1.2296 1.7743 1.1771 1.2209 1.1239 1.1050 1.0754 1.0527 1.1517 2.2067 2.7601 1.4654 1.1879 9.8572 1.0777 1.0632 1.0664 1.0748 1.0493 1.0758 1.0999 1.1007 1.1021 1.0658 1.0468 1.0797 1.1053
irintensity: 1.1415 3.9025 3.5105 12.6164 39.7987 0.9374 7.6863 13.4372 3.7323 12.0125 6.9716 31.1206 12.1485 17.5021 8.9316 0.2058 19.1403 2.1272 26.7275 9.1801 27.8592 56.6121 11.5741 17.0120 243.9823 236.6794 36.2226 49.7745 19.2654 19.3321 24.1445 23.9030 62.7839 44.3479 7.2603 143.7482 28.3389 3.6864 6.5207 7.2424 26.7293 46.2713 7.3213 6.3167 53.2460 3.4360 27.9549 27.5928 32.8130 38.1512 6.0214 17.8628 21.0450 45.5254 66.4404 105.3565 384.5552 81.9514 467.8252 881.9295 333.8072 515.4182 22.6143 20.7571 13.3160 32.0235 13.6635 10.3993 43.7721 90.7399 62.2728 48.6702
temp: 298.150 k
press: 1.00000 atm
elementType: 16 16 8 8 8 7 7 7 6 6 6 6 6 1 1 1 1 1 1 1 1 1 1 1 1 1
symmnumber: 1
zpe: 509223.0 jmol-1
zpe.correction: 0.193953 hartree
zpe.thermalcorrener: 0.212483 hartree
zpe.thermalcorrenthalpy: 0.213427 hartree
zpe.thermalcorrgfe: 0.145973 hartree
zpe.sumelectzpe: -1383.166684 hartree
zpe.sumelectthermal: -1383.148154 hartree
zpe.sumelectthermalent: -1383.147210 hartree
zpe.sumelectthermalfe: -1383.214663 hartree
dipole: 11.2716 -1.3880 0.5436
dipole: 11.3697
quadrupole: -78.1754 -83.6960 -98.0765
quadrupole: -18.3938 -3.3399 6.1367
quadrupole: 8.4739 2.9533 -11.4272 -18.3938 -3.3399 6.1367
hfenergy: -1383.3606368 hartree
pointgroup: C01 [X(C5H13N3O3S2)]
dipole: 4.4135064 -0.0824292 -0.7235864 debye
dipolederiv: -0.7800664 0.09674 -0.0451821 0.1090769 -0.5212229 0.1278519 -0.0285359 0.0855397 -0.5381059 1.8881472 -0.144948 0.1054828 -0.1774209 1.2858509 -0.1703672 0.3127001 -0.1511029 1.3313738 -1.26429 -0.1155391 -0.0476353 0.0075571 -0.2389616 0.0089851 -0.0724318 -0.0295074 -0.5471239 -0.6811173 0.0554024 0.0326704 -0.0998334 -0.8512321 0.0412199 -0.0518645 -0.0271517 -0.5071593 -0.5888684 -0.0236582 0.0863868 0.0343867 -0.480076 -0.0012917 0.0308061 0.0574817 -0.7862759 -0.7340196 0.5961443 0.2870766 0.5953862 -1.4357241 -0.2041276 0.1511628 0.0929344 -0.5058225 -1.3145533 0.2921838 0.2515213 0.1927132 -0.474726 -0.2767823 0.2998636 -0.2652857 -0.7011835 -1.1331628 -0.187737 0.286622 -0.1713518 -0.7537665 0.1534883 0.4211464 0.2150523 -0.6266082 0.3667748 -0.5507293 -0.1150605 -0.5054996 0.9632414 0.0548143 -0.2073656 0.1142539 0.7314345 -0.1482747 0.1745593 0.0150119 0.2003696 -0.2794314 0.0654859 0.0794637 -0.0676825 0.0059259 -0.1647372 0.0633663 0.1238008 -0.1065323 -0.0405118 0.1328689 0.192113 0.0281275 -0.4251215 0.0865657 -0.0537553 -0.0424965 -0.030808 0.0231682 -0.0133568 -0.0478165 -0.0060981 -0.0755829 1.7351471 -0.3477336 -0.6755331 -0.2693897 1.7954002 0.0229675 -0.6283718 -0.2401407 0.6049819 0.2106016 0.0820263 0.024121 0.0574154 0.1889178 -0.0175711 -0.0246033 0.0580394 0.0192865 0.0498394 -0.1195474 -0.0708359 -0.0690963 -0.043754 -0.0597808 -0.0971108 0.0031975 0.0030799 0.1227014 -0.004234 -0.0501618 -0.034106 -0.0718811 -0.0944957 0.0087863 -0.0469014 0.092367 0.003618 0.0661844 -0.0725909 0.1327112 0.0277635 0.0335951 -0.0141138 0.0120372 0.0477612 0.2450058 0.0604237 -0.0363108 0.1634302 0.1497734 0.0190624 -0.0187085 -0.0408186 0.0971655 0.0646487 -0.055602 -0.0350558 -0.058577 0.0151189 -0.0831702 -0.0324731 -0.0537221 0.1013388 -0.1237996 -0.0108891 0.1305265 0.0192603 0.1063332 -0.014591 0.0707019 0.0148514 0.0062818 0.0466443 0.1242112 -0.0501004 0.097219 -0.1044129 0.104503 -0.0272792 0.0557777 0.0463221 0.3056478 0.0170366 0.0168409 0.0578637 0.1878525 0.0459455 0.0439377 0.0818237 0.3358851 0.3002147 -0.0119531 0.063785 -0.0353489 0.1910692 0.072103 0.0862904 0.0428613 0.3067925 1.0327358 -0.0377079 -0.2619913 -0.1418619 0.1333301 0.0816954 -0.5123523 0.0833111 0.3553614 0.1926541 -0.0082174 0.0995644 0.0729461 0.1854129 -0.0337375 0.0769767 -0.0449544 0.2878809 0.2819428 0.0439729 -0.0204558 -0.0405099 0.0424682 0.0046857 -0.0109214 0.0280765 0.3397448 unknown
polarizability: 152.1745923|-14.6660658|145.8570966|-11.1057268|-13.7908109|119.2078234 unknown
InChI: InChI=1S/C5H12N3.HO3S2/c1-3-4(2)8-5(6)7;1-5(2,3)4/h3,6-7H2,1-2H3;1H
charge 0 multiplicity 1
26 atoms
S  -1.170812 -1.661257 2.11167
S  -2.056933 -0.319266 0.544003
O  -3.853745 -0.818492 0.518456
O  -2.104297 1.263343 0.964589
O  -1.440064 -0.619071 -0.930415
N  1.826616 0.148318 -0.426877
N  3.443829 -1.460673 -0.845761
N  1.491479 -2.084961 0.330633
C  1.382388 1.07978 0.380027
C  0.71704 2.299828 -0.205754
C  1.456069 0.979878 1.887492
C  0.550682 2.29416 -1.732356
C  2.24187 -1.130723 -0.262924
H  -0.282706 2.348204 0.284983
H  1.267395 3.196088 0.150683
H  1.518501 1.980416 2.345121
H  2.297082 0.353482 2.230844
H  0.517452 0.503714 2.25305
H  -0.04815 1.419977 -2.040185
H  1.525126 2.246424 -2.250614
H  0.025622 3.209361 -2.058124
H  3.916793 -0.756565 -1.407856
H  3.841695 -2.393989 -0.77771
H  0.587506 -1.865723 0.837408
H  1.693221 -3.075779 0.184802
H  -4.35006 0.050425 0.445714
