program: Gaussian 09
title: 000044605
version: EM64L-G09RevD.01
frameworkgroup: C1[X(C16H24N2O2)]
method: RPBEPBE
basis: SDD
operation: Freq
keyword: #p
keyword: freq=noraman
keyword: PBEPBE/SDD
title: #p freq=noraman PBEPBE/SDD
converged: YES YES NO NO
title: Mulliken charges:
elementType: O O N N C C C C C C C C C C C C C C C C H H H H H H H H H H H H H H H H H H H H H H H H
charge: -0.317258 -0.269192 -0.123860 -0.463720 0.033872 -0.411539 -0.367371 -0.416306 -0.391035 -0.344959 -0.763647 -0.458076 -0.234184 0.254135 0.480091 -0.445036 -0.357609 -0.196223 -0.210808 -0.258786 0.170814 0.204696 0.187865 0.210851 0.173697 0.189891 0.215172 0.206407 0.192150 0.191149 0.217211 0.213825 0.217816 0.230692 0.217941 0.219756 0.218210 0.256483 0.326759 0.221249 0.300149 0.225276 0.225526 0.227926
chargesum: 0.00000
title: Mulliken charges with hydrogens summed into heavy atoms:
elementType: O O N N C C C C C C C C C C C C C C C C
charge: -0.317258 -0.269192 -0.123860 -0.136961 0.204685 -0.018978 0.017178 -0.011243 0.007522 0.063401 -0.101313 -0.020379 0.240509 0.254135 0.480091 -0.223788 -0.057460 0.029053 0.014718 -0.030860
polarizability: 2.70374539e+02 6.07971483e+00 1.70217163e+02 1.20186602e+01 -1.87921252e+01 1.50566534e+02
1716.lowfreq: -10.0219 -3.1412 -0.0006 0.0001 0.0005 3.0227 11.3609 15.8742 20.5947
frequency: 9.3291 15.7711 19.6351 40.7925 63.4401 69.9908 79.2182 97.4038 147.1142 162.0139 176.7907 199.3423 221.4691 249.5852 253.0053 301.3028 319.1480 323.3905 329.8807 341.0745 391.0289 407.8478 413.4210 438.4168 478.0098 509.3312 536.4908 541.1851 600.5835 616.3442 639.4966 696.0914 697.4964 701.3281 709.6205 765.3998 789.0397 815.3701 823.6508 826.4979 840.4267 870.4040 882.0136 895.7166 912.6398 917.0453 925.9329 970.6273 978.8473 984.0233 989.9073 995.8135 996.6909 1010.5621 1032.1745 1050.0874 1079.4675 1085.0166 1089.9552 1104.4463 1116.5770 1124.1843 1135.2293 1155.9880 1161.8609 1171.8847 1172.1646 1189.2738 1210.6783 1226.8945 1247.9544 1260.0510 1261.8905 1272.2319 1273.9920 1302.0800 1314.8446 1325.0405 1325.5912 1338.5842 1348.8166 1353.8800 1363.3412 1370.2643 1381.8445 1385.2460 1388.3667 1433.8893 1448.2092 1456.9168 1462.5705 1465.0606 1471.1308 1476.1133 1479.9487 1485.4015 1488.0608 1488.8545 1518.2283 1600.4094 1618.0542 1661.9472 2803.6290 2821.6321 2845.8237 2966.3954 2977.0409 2982.7619 2984.7907 3002.9627 3013.0016 3030.3887 3038.1148 3040.3527 3046.7237 3051.6760 3065.1352 3078.5950 3082.7376 3094.0831 3112.3119 3131.7258 3143.8891 3165.0676 3188.9053 3543.1391
redmass: 3.9190 4.8370 3.4617 4.5667 4.3746 6.1418 3.3007 3.2486 3.5628 2.4268 4.0701 1.3657 2.2144 3.2600 2.8085 2.6200 2.1586 2.2677 3.2025 5.2465 3.2649 2.9215 3.2467 2.9371 2.6528 2.8257 3.3043 1.6764 5.4889 6.1753 1.2647 2.1436 2.5328 5.2909 8.2983 1.6733 1.4103 1.5095 2.5952 2.6230 1.2686 2.5186 1.7373 1.4959 1.4325 5.1887 1.9962 1.3531 2.0983 6.1451 1.6944 1.3043 1.3790 6.0301 2.3145 1.9727 2.0674 2.5142 1.5567 2.6703 1.7291 1.7270 2.1576 2.2305 3.0840 1.3174 1.0526 1.1129 1.7486 1.5613 1.3019 2.0392 1.2692 1.2421 1.1920 1.2893 1.2780 1.2716 1.3666 1.4217 1.4905 1.6595 1.5166 1.3463 1.5367 1.5150 2.7037 2.3772 1.0898 1.0874 1.0892 1.0724 1.0935 1.0735 1.0744 2.0170 1.1381 1.0654 2.2487 5.2919 6.0403 8.5266 1.0802 1.0717 1.0715 1.0620 1.0580 1.0390 1.0613 1.0610 1.0601 1.0959 1.0893 1.1030 1.0924 1.1035 1.0926 1.0976 1.0994 1.1059 1.0883 1.0868 1.0934 1.0996 1.0953 1.0760
irintensity: 0.5155 0.6929 0.0765 0.2571 0.5439 2.0697 0.4181 0.8693 4.1109 0.1477 2.9682 0.9737 2.3982 1.2190 2.4528 21.3218 5.4404 1.5040 0.3747 7.1251 1.1368 0.0030 0.6174 1.0686 0.4178 26.0966 3.5894 0.9622 0.7652 2.6254 32.3730 17.6348 26.0710 54.4261 10.2333 103.7567 1.1832 2.2585 2.4778 2.4201 0.4395 2.2161 8.4814 6.9008 13.5050 3.1757 3.2099 0.0769 2.0827 7.3885 7.0127 2.5564 8.9485 276.2013 52.7288 18.5738 12.8783 16.1894 32.8978 67.8744 5.7143 9.9884 12.1512 61.3072 447.9848 11.2764 0.6574 7.0468 10.7968 22.1755 12.0928 5.5387 7.3180 2.9546 6.9557 4.8258 12.8966 23.3621 37.7254 0.6388 1.1000 7.8839 12.6712 3.5071 33.1879 20.4187 22.3895 123.2989 7.0227 8.8928 6.9903 9.5303 13.2596 13.9207 2.0372 8.4971 35.3642 8.2962 544.8799 34.9881 112.8650 207.9902 56.0187 89.5683 183.8701 41.9970 21.2318 41.3062 28.4446 17.9261 26.2942 73.1552 33.4077 24.8286 3.2267 85.2533 32.0404 46.7313 36.5368 46.8440 14.5397 0.6603 32.3153 24.6801 6.8102 27.6007
temp: 298.150 k
press: 1.00000 atm
elementType: 8 8 7 7 6 6 6 6 6 6 6 6 6 6 6 6 6 6 6 6 1 1 1 1 1 1 1 1 1 1 1 1 1 1 1 1 1 1 1 1 1 1 1 1
symmnumber: 1
zpe: 989147.7 jmol-1
zpe.correction: 0.376746 hartree
zpe.thermalcorrener: 0.396771 hartree
zpe.thermalcorrenthalpy: 0.397715 hartree
zpe.thermalcorrgfe: 0.323960 hartree
zpe.sumelectzpe: -882.522948 hartree
zpe.sumelectthermal: -882.502923 hartree
zpe.sumelectthermalent: -882.501979 hartree
zpe.sumelectthermalfe: -882.575734 hartree
dipole: 1.6953 2.3428 -1.2815
dipole: 3.1631
quadrupole: -104.5649 -117.5108 -121.1486
quadrupole: -2.2709 4.7313 -2.1542
quadrupole: 9.8432 -3.1027 -6.7405 -2.2709 4.7313 -2.1542
hfenergy: -882.8996942 hartree
pointgroup: C01 [X(C16H24N2O2)]
dipole: -0.6605122 0.6267672 0.8482499 debye
polarizability: 270.7549531|-9.2144561|152.6165527|6.8456946|19.9960269|167.7867299 unknown
InChI: InChI=1S/C16H24N2O2/c1-14-8-5-6-11-18(14)12-7-13-20-16(19)17-15-9-3-2-4-10-15/h2-4,9-10,14,17H,5-8,11-13H2,1H3
charge 0 multiplicity 1
44 atoms
O  0.573312 1.023254 0.477405
O  1.410058 -0.348033 -1.248229
N  -3.727886 0.306419 0.167378
N  2.783378 0.57075 0.458338
C  -4.977145 0.198282 -0.658306
C  -5.412961 -1.287275 -0.742559
C  -3.93211 -0.258309 1.530548
C  -5.609645 -1.929347 0.64589
C  -4.330463 -1.744793 1.487583
C  -3.177721 1.687855 0.240771
C  -4.786607 0.756038 -2.085478
C  -1.720633 1.741217 0.758437
C  -0.797625 0.861445 -0.085153
C  1.591251 0.338422 -0.211936
C  4.080437 0.094768 0.12445
C  5.153033 0.470115 0.978279
C  4.334924 -0.723833 -1.008149
C  6.464861 0.034177 0.703903
C  5.655079 -1.150914 -1.267561
C  6.726335 -0.780461 -0.422573
H  -5.807746 0.76954 -0.158893
H  -4.633049 -1.841846 -1.301732
H  -6.34991 -1.346468 -1.32973
H  -2.993186 -0.146861 2.100804
H  -4.722453 0.318906 2.082461
H  -6.464145 -1.444124 1.16211
H  -5.86175 -3.001927 0.543113
H  -3.501465 -2.325241 1.038226
H  -4.479094 -2.114937 2.520425
H  -3.812506 2.351527 0.88392
H  -3.190391 2.118552 -0.774561
H  -4.739949 1.858249 -2.122146
H  -5.638992 0.446965 -2.717294
H  -3.861023 0.347669 -2.531846
H  -1.65406 1.433437 1.8179
H  -1.372666 2.790845 0.712568
H  -0.786652 1.169783 -1.14708
H  -1.087896 -0.201404 -0.039823
H  2.69862 1.160542 1.288997
H  4.958591 1.101927 1.854651
H  3.508901 -1.012027 -1.661536
H  7.28171 0.33151 1.370924
H  5.844396 -1.781919 -2.143384
H  7.745443 -1.119374 -0.636208
