program: Gaussian 09
title: 000005192
version: EM64L-G09RevD.01
frameworkgroup: C1[X(C10H18O4)]
method: RPBEPBE
basis: SDD
operation: Freq
keyword: #pfreq=noraman
keyword: PBEPBE/SDD
title: #p freq=noraman PBEPBE/SDD
converged: YES YES NO NO
title: Mulliken charges:
elementType: O O O O C C C C C C C C C C H H H H H H H H H H H H H H H H H H
charge: -0.417719 -0.417741 -0.231113 -0.231118 -0.382873 -0.382907 -0.368728 -0.368720 -0.375915 -0.375914 -0.487938 -0.487920 0.171155 0.171166 0.196205 0.196104 0.196232 0.196087 0.192202 0.192334 0.192158 0.192380 0.218292 0.217546 0.218616 0.217228 0.252469 0.252638 0.252380 0.252709 0.375352 0.375352
chargesum: 0.00000
title: Mulliken charges with hydrogens summed into heavy atoms:
elementType: O O O O C C C C C C C C C C
charge: -0.042367 -0.042388 -0.231113 -0.231118 0.009437 0.009412 0.015808 0.015817 0.059923 0.059930 0.017170 0.017169 0.171155 0.171166
polarizability: 1.62785917e+02 -1.45796852e+00 1.14124484e+02 -1.51406003e-01 1.63552671e-02 8.53418369e+01
1716.lowfreq: -0.0005 -0.0003 0.0006 2.8023 5.8948 12.7550 14.3345 23.1843 32.7233
frequency: 12.7547 23.1840 32.7230 42.2368 56.2874 74.2430 85.9965 100.6447 118.5894 145.9087 155.7553 160.9865 161.2144 256.6292 314.0742 368.2602 446.2248 465.4265 500.6262 500.6384 511.3114 586.0813 591.0619 635.3940 635.5691 724.4303 726.0160 744.7132 788.1325 850.0914 855.5183 858.7669 922.9030 988.6534 999.7933 1003.8967 1023.4658 1043.3255 1066.1064 1076.5420 1082.2749 1085.9647 1110.2541 1112.8926 1121.8058 1200.5475 1209.1842 1232.9934 1235.9827 1247.3040 1268.5364 1270.2547 1283.7401 1286.4926 1298.7603 1300.3979 1300.6507 1331.5372 1355.4805 1361.1548 1374.0552 1374.0971 1438.3770 1438.3998 1462.7758 1463.9291 1466.5095 1473.9311 1482.6994 1489.0854 1669.3878 1669.4788 2951.9682 2953.7707 2956.2429 2965.8226 2986.7999 2986.8907 2987.6893 2994.5397 2995.9882 2996.2158 3010.6703 3027.9258 3031.6707 3038.1438 3061.6196 3063.0029 3512.2561 3512.3355
redmass: 11.0586 5.7001 5.9210 2.5027 3.4417 1.8025 5.8023 2.4766 1.9134 2.1091 1.9914 5.4688 7.0592 4.8795 4.9465 4.5142 3.7328 3.8865 1.7715 1.7613 3.2420 4.7814 4.5774 1.3306 1.3295 1.0659 1.1057 1.1979 1.3168 1.3866 5.0518 4.6578 1.3640 5.2435 1.2418 3.6680 3.9448 2.4754 2.8595 2.5557 2.0760 2.1732 3.7665 1.5972 1.3437 1.5651 1.2676 1.3926 1.3422 1.5043 1.2056 1.5087 1.0379 1.1009 1.1085 1.1410 1.4431 1.5574 1.6023 1.6880 1.8424 1.8366 1.0848 1.0847 1.0716 1.0739 1.0710 1.0935 1.0984 1.1004 8.2294 8.2321 1.0588 1.0590 1.0594 1.0590 1.0614 1.0615 1.0967 1.0994 1.0596 1.0596 1.1026 1.1002 1.0994 1.1034 1.1032 1.1031 1.0639 1.0639
irintensity: 2.5126 0.0674 0.6784 0.0001 0.0001 0.6084 0.0000 0.0066 0.0000 0.0002 0.1363 4.1496 0.0023 0.0000 12.0635 9.3418 0.0000 0.0075 60.0479 0.4930 53.7576 27.1287 0.0067 5.5271 249.8724 24.0951 0.0003 10.1709 0.0003 5.7838 3.3050 0.0003 0.0016 0.0010 2.1170 147.0445 281.1618 0.0061 0.0001 156.1385 0.0001 17.2487 0.0011 0.0141 0.9485 0.0005 48.2086 0.0001 0.1868 6.6497 0.0011 0.0001 0.0010 0.7852 0.5662 7.4893 53.2446 0.0004 38.9850 0.0001 55.7613 0.0003 50.6907 4.9605 0.1126 0.0000 0.0000 5.7341 0.0000 29.8590 2.3012 415.5489 8.8768 0.0001 0.0000 106.0454 8.4718 1.3786 0.0037 5.4158 0.3511 80.3412 0.0001 14.7732 0.0034 48.5090 0.0011 165.3073 19.9575 16.1083
temp: 298.150 k
press: 1.00000 atm
elementType: 8 8 8 8 6 6 6 6 6 6 6 6 6 6 1 1 1 1 1 1 1 1 1 1 1 1 1 1 1 1 1 1
symmnumber: 1
zpe: 706913.2 jmol-1
zpe.correction: 0.269249 hartree
zpe.thermalcorrener: 0.286199 hartree
zpe.thermalcorrenthalpy: 0.287143 hartree
zpe.thermalcorrgfe: 0.219885 hartree
zpe.sumelectzpe: -691.652251 hartree
zpe.sumelectthermal: -691.635301 hartree
zpe.sumelectthermalent: -691.634357 hartree
zpe.sumelectthermalfe: -691.701615 hartree
dipole: 0.0004 -0.0001 0.0142
dipole: 0.0142
quadrupole: -81.8848 -96.8032 -82.7650
quadrupole: -14.7614 -0.0462 -0.0672
quadrupole: 5.2662 -9.6522 4.3860 -14.7614 -0.0462 -0.0672
hfenergy: -691.9215 hartree
pointgroup: C01 [X(C10H18O4)]
dipole: 0.0001365 -0.0000319 -0.0055855 debye
polarizability: 162.7704527|1.7007318|114.1379169|0.0213478|-0.2582646|85.3438682 unknown
InChI: InChI=1S/C10H18O4/c11-9(12)7-5-3-1-2-4-6-8-10(13)14/h11,13H,1-8H2
charge 0 multiplicity 1
32 atoms
O  6.872359 0.799985 -0.035775
O  -6.868674 -0.808657 -0.019291
O  5.954549 -1.331792 -0.016409
O  -5.951106 1.323273 -0.010439
C  0.667721 -0.39576 -0.014921
C  -0.664051 0.387351 -0.032603
C  1.912441 0.519336 -0.038475
C  -1.908793 -0.527759 -0.008622
C  3.238853 -0.271381 -0.019621
C  -3.23523 0.262859 -0.028328
C  4.468081 0.65639 -0.044154
C  -4.464398 -0.664954 -0.003062
C  5.785344 -0.093215 -0.0302
C  -5.781743 0.084647 -0.011474
H  0.701572 -1.082446 -0.886304
H  0.703375 -1.039214 0.888838
H  -0.697813 1.074176 0.838683
H  -0.699864 1.030667 -0.936442
H  1.875631 1.162174 -0.943064
H  1.876708 1.206301 0.833091
H  -1.872116 -1.169794 0.896555
H  -1.872757 -1.215477 -0.879567
H  3.279872 -0.958834 -0.886148
H  3.280947 -0.913757 0.880914
H  -3.276545 0.951203 0.837441
H  -3.277147 0.904294 -0.929581
H  4.458869 1.305734 -0.942056
H  4.463077 1.348938 0.820545
H  -4.452871 -1.315696 0.893921
H  -4.4617 -1.356159 -0.86872
H  7.720739 0.278364 -0.028125
H  -7.717131 -0.287098 -0.021506
