program: Gaussian 09
title: 000044600
version: EM64L-G09RevD.01
frameworkgroup: C1[X(C10H12ClNO2)]
method: RPBEPBE
basis: SDD
operation: Freq
keyword: #p
keyword: freq=noraman
keyword: PBEPBE/SDD
title: #p freq=noraman PBEPBE/SDD
converged: YES YES NO NO
title: Mulliken charges:
elementType: Cl O O N C C C C C C C C C C H H H H H H H H H H H H
charge: -0.062872 -0.414112 -0.239720 -0.572920 -0.231297 0.540963 -0.506413 -0.437775 -0.435532 -0.384940 0.194810 -0.203781 -0.228624 -0.109973 0.240992 0.232420 0.250134 0.208846 0.236340 0.248418 0.230172 0.279067 0.280491 0.254887 0.252494 0.377923
chargesum: 0.00000
title: Mulliken charges with hydrogens summed into heavy atoms:
elementType: Cl O O N C C C C C C C C C C
charge: -0.062872 -0.036190 -0.239720 -0.013362 0.009695 0.540963 -0.023859 0.007411 -0.187114 -0.154767 0.194810 0.051106 0.023870 -0.109973
polarizability: 1.72646442e+02 -1.46854887e+01 1.00468674e+02 7.59907326e-01 6.25396028e+00 1.15111911e+02
1716.lowfreq: -9.3647 0.0019 0.0021 0.0025 2.6942 8.1604 21.5784 27.4548 35.4218
frequency: 21.5244 27.4226 35.3657 77.2766 83.7327 133.8599 159.6335 180.5114 237.0908 260.6035 273.5966 305.5237 342.0947 356.8357 408.9786 414.9950 454.7655 478.6409 521.6073 533.5732 603.5684 627.0709 644.6236 668.4597 721.0224 775.6261 819.0493 824.9267 829.9241 882.4283 942.7014 950.3140 963.4592 967.5717 1000.0164 1050.4221 1063.4198 1073.6666 1099.3080 1113.7335 1139.0110 1179.2838 1186.7937 1213.0876 1249.7197 1282.1691 1294.6829 1308.6442 1334.2180 1343.8514 1362.7650 1382.4576 1404.8501 1439.0582 1456.9158 1477.6204 1585.6456 1598.9010 1633.9700 1660.2427 2961.0942 2986.4849 3001.9070 3048.2892 3071.3038 3127.7682 3137.4157 3166.7667 3171.9787 3506.2605 3517.9698 3653.0639
redmass: 4.7038 8.2786 7.6269 5.0031 2.9710 3.5329 4.3034 3.3958 3.7212 1.3494 4.9342 2.8602 1.4749 3.3953 2.8688 4.3852 5.6489 3.3237 2.2581 2.6559 3.0644 6.6210 2.8831 2.0018 3.3958 3.6906 1.5733 1.4520 1.3613 3.5906 1.6093 1.6867 1.5107 2.0997 4.1395 2.9499 1.9661 2.6862 1.6931 2.8100 1.6834 1.3357 1.1227 2.0509 1.4867 1.4590 1.4353 1.4512 1.1715 1.4091 1.9264 4.4594 2.0556 1.0982 1.0921 2.4407 7.1554 6.2674 1.0997 8.3359 1.0660 1.0609 1.0837 1.1039 1.0924 1.0890 1.0900 1.0952 1.0960 1.0638 1.0443 1.1011
irintensity: 0.5731 1.4997 0.9841 0.4497 5.0234 2.1440 8.5680 6.7043 18.6866 87.1815 9.0213 64.6461 259.8358 16.8271 0.0968 8.0638 68.2657 35.5626 27.9398 64.1265 6.8059 1.5743 6.7313 135.9250 6.9041 6.9615 3.6925 26.1229 20.6362 12.3249 8.7991 20.3027 1.1075 6.5987 33.1405 211.9020 66.2088 40.8944 21.3717 34.8168 36.6388 5.5101 2.0584 2.8788 1.6447 0.5020 21.7152 10.7611 6.7696 19.1754 32.9150 1.6144 7.0225 23.3093 3.6427 84.5456 0.6003 3.9296 40.1419 182.1781 34.5236 28.7364 11.1888 26.3616 13.3622 13.6670 7.1843 6.1182 1.4950 23.2558 8.6122 5.4438
temp: 298.150 k
press: 1.00000 atm
elementType: 17 8 8 7 6 6 6 6 6 6 6 6 6 6 1 1 1 1 1 1 1 1 1 1 1 1
symmnumber: 1
zpe: 531220.5 jmol-1
zpe.correction: 0.202331 hartree
zpe.thermalcorrener: 0.216888 hartree
zpe.thermalcorrenthalpy: 0.217832 hartree
zpe.thermalcorrgfe: 0.158084 hartree
zpe.sumelectzpe: -1052.480852 hartree
zpe.sumelectthermal: -1052.466296 hartree
zpe.sumelectthermalent: -1052.465352 hartree
zpe.sumelectthermalfe: -1052.525099 hartree
dipole: 2.9789 -0.1756 -0.9173
dipole: 3.1218
quadrupole: -91.4754 -91.8738 -86.0716
quadrupole: 0.0224 -2.5488 -1.4934
quadrupole: -1.6685 -2.0668 3.7353 0.0224 -2.5488 -1.4934
hfenergy: -1052.6831837 hartree
pointgroup: C01 [X(C10H12Cl1N1O2)]
dipole: 1.1886686 -0.0234182 0.308308 debye
dipolederiv: -0.8964307 -0.1292558 0.0446032 -0.1457116 -0.1001393 0.0120973 0.0518749 0.0121667 -0.1343751 -0.4271682 0.0877462 -0.0440169 0.2546674 -1.1338964 0.4009557 -0.0541455 0.3674121 -0.4011317 -0.361288 0.0542117 -0.0122392 0.1237335 -0.6436578 -0.1141856 -0.0493186 0.0817228 -0.9180707 -0.7686458 -0.2945474 -0.0371052 -0.4404187 -1.0373405 -0.3069329 -0.0651233 -0.3278229 -0.2985887 -0.0262549 -0.1269101 -0.0397061 -0.2726434 -0.0406613 -0.0441269 -0.1888407 -0.188317 0.037325 0.3975006 0.0840138 -0.0022233 -0.0010343 -0.1446013 -0.0164298 -0.026565 -0.0051892 -0.086364 -0.0111487 -0.1251733 -0.1011537 0.0262846 -0.3299321 -0.1466114 -0.0149043 -0.202774 -0.0703188 0.6029506 0.2770923 0.0400403 0.4495077 0.5308801 0.0891039 0.1179566 0.1865418 0.2347383 -0.0784935 0.0007726 -0.0397357 0.0195094 -0.1214521 0.0062932 -0.0303137 -0.0204228 0.073486 -0.0558531 0.0101181 0.0282718 0.0189436 -0.1335696 -0.0155697 0.0685521 0.0078627 0.0540272 0.2237702 -0.0782931 0.1187437 -0.3697177 1.5818965 -0.0894329 0.0841194 -0.1436799 1.1728213 -0.281675 -0.0290246 0.0875992 -0.0218244 -0.0944524 0.0139731 0.0863225 0.0033807 0.0063394 -0.3027719 -0.0174955 -0.0260607 -0.0204802 -0.106234 -0.014944 -0.0570945 -0.0183761 0.0202402 1.231929 0.2091434 -0.0740691 0.2263905 -0.035364 -0.0281908 -0.0630335 -0.0236491 0.1026066 0.0256075 0.007102 0.0094255 -0.0252016 0.0492868 0.0255994 0.0517861 0.0590759 -0.0911362 -0.1367584 0.0662849 0.0109222 -0.0072935 0.1960823 -0.0012443 0.0040308 -0.0137116 0.0765113 0.1101994 0.008546 0.0790584 -0.0055321 0.0406385 0.0210358 0.0440433 0.0432682 -0.0537739 0.0379935 -0.0306611 0.0471776 -0.0510311 0.0477055 0.0578036 0.0630256 -0.0045649 -0.1288874 -0.0296 0.0894973 -0.0396936 0.092574 -0.0851206 0.0186528 -0.0701266 0.0369332 0.0495521 0.0349957 -0.0289008 0.0887484 -0.030505 0.1349571 0.014948 0.0680487 0.0170417 -0.0242774 -0.0001393 -0.0168566 -0.1065745 -0.0201524 0.1299892 -0.0016323 -0.1102727 -0.0003307 -0.0210175 0.1281512 -0.0098097 0.0099985 0.1051486 0.4251656 0.006069 0.0548804 0.077195 0.0561739 0.1006733 0.0534513 -0.0083526 0.1472614 0.2867926 0.1744747 0.0480337 0.1683252 0.2147413 0.0350659 -0.0137638 -0.0732302 -0.0206881 0.159753 -0.0018552 -0.0738904 -0.0001289 0.0037927 0.0552669 -0.0211304 0.0598955 -0.0217492 0.1564879 0.0251598 0.062466 0.0235538 -0.0165162 0.3921236 -0.0261576 -0.0203237 -0.0100374 0.2667863 -0.0850105 -0.0015113 -0.135513 0.1421022 unknown
polarizability: 172.3661966|15.5204032|98.710883|1.074216|0.1981247|117.1499481 unknown
InChI: InChI=1S/C10H12ClNO2/c11-9-3-1-7(2-4-9)8(6-12)5-10(13)14/h1-4,8,13H,5-6,12H2
charge 0 multiplicity 1
26 atoms
Cl -4.792364 -0.31286 0.271826
O  2.239071 -2.809914 0.075196
O  1.965326 -1.548685 -1.853366
N  3.046158 2.532947 0.487627
C  1.276958 0.772968 -0.152471
C  -0.218064 0.4851 -0.043763
C  2.142989 -0.41355 0.339176
C  1.657933 2.094383 0.613881
C  -1.030505 0.435693 -1.204828
C  -0.838319 0.282681 1.218355
C  2.093819 -1.594383 -0.609256
C  -2.420881 0.194403 -1.121448
C  -2.225282 0.04022 1.324752
C  -2.997006 0.00159 0.147444
H  1.522935 0.929119 -1.221202
H  3.201776 -0.078984 0.387151
H  1.85882 -0.750261 1.350725
H  1.431087 1.97437 1.69066
H  0.990592 2.896938 0.245741
H  -0.569911 0.57241 -2.189751
H  -0.241408 0.308524 2.137943
H  3.373658 2.790339 -0.443485
H  3.746602 2.09332 1.08277
H  -3.038204 0.153152 -2.023389
H  -2.695358 -0.115087 2.300289
H  2.222276 -3.558331 -0.582274
