program: Gaussian 09
title: 000005259
version: EM64L-G09RevD.01
frameworkgroup: C1[X(C10H26N6O2)]
method: RPBEPBE
basis: SDD
operation: Freq
keyword: #p
keyword: freq=noraman
keyword: PBEPBE/SDD
title: #p freq=noraman PBEPBE/SDD
converged: YES YES NO NO
title: Mulliken charges:
elementType: O O N N N N N N C C C C C C C C C C H H H H H H H H H H H H H H H H H H H H H H H H H H
charge: -0.387138 -0.317064 -0.017811 -0.276590 -0.076989 -0.570911 -0.570751 0.110788 -0.361245 -0.380106 -0.359270 -0.371128 -0.342681 -0.371740 -0.350338 -0.378794 -0.370113 -0.369192 0.220979 0.191868 0.217888 0.183542 0.237470 0.216457 0.180350 0.205729 0.210641 0.222273 0.205889 0.240531 0.236084 0.170991 0.204725 0.242280 0.168924 0.203033 0.177766 0.204515 0.173637 0.276183 0.265287 0.258862 0.272850 0.372319
chargesum: 0.00000
title: Mulliken charges with hydrogens summed into heavy atoms:
elementType: O O N N N N N N C C C C C C C C C C
charge: -0.014818 -0.317064 -0.017811 -0.040506 -0.076989 -0.029442 -0.039038 0.110788 0.051601 0.021324 0.094657 0.014950 0.090234 0.074680 0.025378 0.032410 0.010686 0.008960
polarizability: 2.13346288e+02 -1.55829152e+01 1.58872859e+02 -8.72350059e+00 8.64103131e-01 1.36147961e+02
1716.lowfreq: -6.4012 -0.0007 0.0006 0.0010 1.8826 3.7794 15.3088 21.2244 27.7346
frequency: 15.2811 21.1259 27.5255 29.7845 37.9785 45.5427 56.7883 71.1249 76.3714 90.4696 105.5978 111.0222 129.5203 136.7558 142.8785 154.9624 164.2902 187.7512 225.6677 230.1574 253.7713 275.6457 296.3691 302.4769 350.4091 369.6767 421.9684 440.3108 476.9695 486.4753 500.0460 565.4128 586.0865 598.1216 606.0272 632.9357 675.2481 679.3554 743.6910 768.1933 770.3766 795.9380 864.9183 869.0846 902.3340 926.2940 953.7971 968.7131 987.8590 1009.8743 1027.4182 1041.9705 1058.8070 1066.6276 1082.5286 1085.0638 1092.3462 1100.2708 1105.6811 1112.9417 1117.8191 1140.1569 1149.6631 1186.7602 1197.0160 1208.7340 1220.4164 1222.8003 1235.4762 1245.8948 1269.1906 1274.1258 1279.0857 1285.7116 1286.9518 1289.5384 1296.3471 1299.5197 1314.2536 1327.0025 1352.9648 1356.2303 1368.4785 1389.1606 1392.0466 1395.2609 1409.3795 1451.3608 1465.1673 1467.5924 1468.5042 1469.7523 1477.5267 1480.9619 1487.3134 1493.8033 1495.4739 1500.4294 1638.6849 1640.7941 2834.7399 2844.3229 2859.3577 2861.3931 2949.3787 2952.3439 2952.5387 2961.0249 2982.1229 2988.5346 2990.3132 2992.0908 3009.4750 3011.2758 3023.9072 3046.3324 3048.3703 3065.3500 3073.9155 3078.1895 3108.3222 3416.4318 3453.7051 3461.0641 3581.5911 3589.4293
redmass: 5.1024 4.0540 3.1640 2.8638 3.4635 3.2563 2.2815 2.6935 2.7052 2.8948 2.7088 2.1540 2.9750 3.2155 2.0476 2.6022 4.4913 3.2158 1.5136 1.2303 1.9878 2.9134 4.2515 4.8412 4.9149 3.4692 9.3167 3.6340 4.1410 3.0184 3.9672 3.6412 1.3198 1.2855 1.1435 6.0303 1.3414 5.6237 1.0905 1.1078 1.0794 1.1911 1.2645 1.1939 2.5870 1.7298 2.2455 3.4598 2.6273 3.7426 2.5692 3.5483 2.8947 2.6785 2.3098 2.2968 1.9421 2.4811 1.9134 2.5814 1.7347 1.7096 4.0884 2.1594 1.8826 1.8184 1.8146 1.3522 1.9789 1.3251 1.2693 1.2142 1.1373 1.1190 1.1042 1.1075 1.1577 1.2628 1.2966 1.3286 1.4816 1.4786 1.4164 1.4240 1.4487 1.5433 1.8468 1.2111 1.0866 1.0750 1.0779 1.0774 1.1046 1.0974 1.0915 1.0908 1.0894 1.0859 1.0940 1.0935 1.0716 1.0711 1.0717 1.0717 1.0671 1.0688 1.0673 1.0643 1.0633 1.0673 1.0841 1.0827 1.0838 1.0856 1.0972 1.0920 1.0983 1.0958 1.0991 1.1011 1.0620 1.0739 1.0448 1.0449 1.0975 1.0979
irintensity: 1.1899 1.0452 2.0457 3.8294 1.5748 0.8018 2.7033 0.0289 1.2501 0.5612 0.9072 0.2803 0.8621 1.8678 4.1278 1.2837 0.4092 5.2530 8.2495 73.9936 16.6556 34.8316 0.4758 9.0560 7.1195 3.9880 2.0277 17.1199 20.9346 25.6426 4.1541 15.4108 226.4880 200.6837 108.5909 41.5940 130.8429 16.6801 12.2805 6.5503 6.4801 1.0655 3.3069 0.4406 12.5079 25.1563 1.7848 114.2344 34.5038 8.9654 3.8126 3.1740 17.3490 2.1836 1.7659 6.5172 18.6607 5.1020 7.6437 23.8523 16.5039 133.4413 29.3703 3.5583 25.2229 66.8138 31.4416 1.2014 19.2958 7.3684 2.9543 4.0798 5.2270 1.7412 2.9096 4.6478 4.6866 0.6028 23.2510 2.6283 60.4445 22.0782 6.6320 23.9657 19.4267 3.1514 15.0322 30.2368 2.1363 2.7346 0.8512 1.0061 6.3648 12.7998 10.2387 0.8986 4.3311 4.9438 40.6755 42.1900 45.4225 112.6770 105.0305 197.7535 13.2844 19.9247 57.9429 18.0549 25.8754 5.9963 4.1249 79.7994 44.2170 57.3473 5.7693 10.3923 38.0712 47.2832 52.5737 40.5339 23.1490 2.2130 1.6458 0.6247 0.1570 0.5551
temp: 298.150 k
press: 1.00000 atm
elementType: 8 8 7 7 7 7 7 7 6 6 6 6 6 6 6 6 6 6 1 1 1 1 1 1 1 1 1 1 1 1 1 1 1 1 1 1 1 1 1 1 1 1 1 1
symmnumber: 1
zpe: 993471.7 jmol-1
zpe.correction: 0.378393 hartree
zpe.thermalcorrener: 0.402165 hartree
zpe.thermalcorrenthalpy: 0.403109 hartree
zpe.thermalcorrgfe: 0.319823 hartree
zpe.sumelectzpe: -873.933851 hartree
zpe.sumelectthermal: -873.910080 hartree
zpe.sumelectthermalent: -873.909136 hartree
zpe.sumelectthermalfe: -873.992422 hartree
dipole: -2.7378 2.5108 0.8450
dipole: 3.8097
quadrupole: -104.9953 -109.2227 -123.3009
quadrupole: 20.7970 28.5381 -0.1957
quadrupole: 7.5110 3.2836 -10.7946 20.7970 28.5381 -0.1957
hfenergy: -874.3122449 hartree
pointgroup: C01 [X(C10H26N6O2)]
dipole: 1.1065829 -0.9569917 0.3257916 debye
polarizability: 214.3142354|-14.0678462|158.0720279|8.0054506|-0.5946967|135.9808448 unknown
InChI: InChI=1S/C10H26N6O2/c11-5-3-8-13-7-1-2-9-15(10-4-6-12)16(18)14-17/h13,18H,1-12H2
charge 0 multiplicity 1
44 atoms
O  -3.901774 1.782662 1.345039
O  -4.876292 2.562972 -0.879739
N  -2.399341 0.276995 0.099132
N  3.939665 0.233714 0.170429
N  -3.345424 1.256594 0.044309
N  -5.719723 -3.43413 -0.361436
N  8.906752 0.003905 0.164844
N  -3.931586 1.691876 -1.117793
C  0.089784 0.028407 -0.15125
C  1.471331 0.48743 0.366733
C  -1.060598 0.733406 0.593631
C  2.635498 -0.208848 -0.365182
C  -2.893908 -1.030809 0.63672
C  -4.102243 -1.573038 -0.143401
C  5.116416 -0.41818 -0.445994
C  6.426887 0.109013 0.168673
C  -4.556193 -2.944545 0.400699
C  7.680423 -0.536526 -0.456421
H  -0.007481 0.238334 -1.233439
H  0.0048 -1.070178 -0.030489
H  1.567505 0.281763 1.450587
H  1.564844 1.587384 0.242026
H  -1.006955 1.822606 0.423344
H  -0.978569 0.56358 1.689075
H  2.533924 -0.035889 -1.468449
H  2.560515 -1.304674 -0.211855
H  -2.045378 -1.732704 0.546094
H  -3.138393 -0.927065 1.71661
H  -4.946985 -0.859135 -0.068789
H  -3.85387 -1.672619 -1.214523
H  4.027034 1.26051 0.140213
H  5.147234 -0.286359 -1.559371
H  5.036667 -1.508724 -0.261224
H  6.428891 -0.075967 1.257423
H  6.479222 1.211381 0.028093
H  -3.734581 -3.676762 0.274707
H  -4.737991 -2.85142 1.501303
H  7.654912 -1.627304 -0.266494
H  7.637907 -0.403012 -1.567001
H  -5.972586 -4.409302 -0.178802
H  -6.533132 -2.81155 -0.327215
H  9.010115 1.018569 0.05945
H  9.765936 -0.494855 -0.085179
H  -4.608054 2.408594 0.952712
