program: Gaussian 09
title: 000044559
version: EM64L-G09RevD.01
frameworkgroup: C1[X(C10H16N2S4)]
method: RPBEPBE
basis: SDD
operation: Freq
keyword: #p
keyword: freq=noraman
keyword: PBEPBE/SDD
title: #p freq=noraman PBEPBE/SDD
converged: YES YES NO NO
title: Mulliken charges:
elementType: S S S S N N C C C C C C C C C C H H H H H H H H H H H H H H H H
charge: 0.191092 0.177689 -0.006148 -0.002514 -0.005427 -0.004127 -0.617328 -0.628536 -0.614888 -0.623879 -0.430649 -0.421132 -0.696311 -0.716039 0.025515 0.129586 0.273430 0.235936 0.235300 0.260726 0.235204 0.260763 0.234872 0.240724 0.273037 0.258189 0.266128 0.235533 0.318670 0.319465 0.290989 0.304131
chargesum: 0.00000
title: Mulliken charges with hydrogens summed into heavy atoms:
elementType: S S S S N N C C C C C C C C C C
charge: 0.191092 0.177689 -0.006148 -0.002514 -0.005427 -0.004127 0.127338 0.128157 0.133745 0.135970 -0.430649 -0.421132 -0.058176 -0.120920 0.025515 0.129586
polarizability: 3.23159986e+02 1.03872360e+01 1.80546377e+02 -4.58565973e+00 -2.84354718e+00 1.40429340e+02
1716.lowfreq: -7.9764 -3.9166 -0.7374 -0.0018 0.0021 0.0021 6.6696 12.9901 14.3785
frequency: 5.5148 12.3740 13.8583 24.4577 34.9765 48.8420 56.7144 70.3371 87.2058 87.3609 96.0933 116.3958 117.0531 144.9032 202.8163 220.1980 247.7295 249.1707 265.4210 276.6779 293.9138 319.0127 328.4417 376.9121 380.5945 413.6924 421.5950 434.8730 460.2703 528.0792 530.1571 535.3550 538.2228 650.0791 673.9132 781.0966 845.3540 851.0019 876.4049 879.6945 946.1327 950.2237 1049.5833 1050.4164 1082.7541 1083.1792 1129.4832 1131.5798 1132.5473 1134.1558 1137.2309 1183.7812 1193.4152 1236.7030 1240.4466 1244.8031 1257.7915 1376.3191 1381.7514 1415.3173 1421.2686 1423.3993 1432.3657 1452.2759 1453.2619 1464.4733 1466.0072 1475.5990 1476.2418 1484.2048 1484.8898 1499.3222 1502.9022 2271.7386 2892.9634 2972.9511 2976.2031 2978.8110 2982.5989 3024.8504 3057.2971 3059.5127 3062.6540 3066.0991 3069.2558 3090.3571 3110.3279 3111.4187 3112.7552 3118.1370
redmass: 4.1852 5.2752 6.7253 1.7171 2.7763 5.6972 1.4869 4.4026 1.2716 1.2413 3.2630 1.9012 2.0356 6.5419 4.2844 3.0450 2.8050 2.9429 4.3020 5.3937 3.6990 7.1053 6.5010 5.1848 6.0040 3.3623 3.4319 6.6096 9.8613 9.0916 9.7804 4.6845 4.8991 8.1372 8.3633 4.4004 5.5164 5.2620 1.5217 1.6631 4.8830 5.2688 1.5241 1.5373 1.2245 1.2258 1.1503 1.4869 1.6545 1.3706 1.7053 1.0649 2.4752 3.2462 2.3791 1.9698 1.3958 2.2776 2.1493 1.0984 1.1387 1.1431 1.0997 1.1514 1.1337 1.0421 1.0552 1.0704 1.0744 1.0448 1.0444 1.4211 1.4830 11.6798 1.0705 1.0341 1.0344 1.0356 1.0360 1.0566 1.1016 1.1023 1.1023 1.1006 1.0903 1.1061 1.0990 1.1000 1.0991 1.0989
irintensity: 1.3502 0.6380 0.1180 0.1499 1.3399 2.8783 0.3490 5.5175 0.3109 0.5964 3.4821 0.1666 0.7605 3.1364 4.3638 4.0912 6.7557 7.7455 21.3152 2.8271 16.6843 0.0257 0.2879 7.8461 35.5124 3.8932 4.7064 9.1828 27.6410 4.2222 0.0638 3.9686 6.6326 45.5418 24.5475 2.2055 40.4703 25.6387 1.6631 23.7909 263.7613 84.1613 19.3775 17.8893 0.2343 2.1415 9.3799 45.5213 84.4666 21.4221 82.7963 13.0858 6.2539 53.5868 120.1454 21.0095 12.4378 88.9025 88.0506 32.1388 13.3984 25.3276 9.3430 11.9579 11.7111 22.9758 26.4651 12.7886 17.2325 10.5705 8.4902 168.6538 168.3584 3.3433 181.9438 51.1447 47.8869 57.7828 51.6728 1.6092 15.5594 31.7174 28.4286 15.2366 16.8961 0.6330 22.4502 22.0170 6.1434 2.8825
temp: 298.150 k
press: 1.00000 atm
elementType: 16 16 16 16 7 7 6 6 6 6 6 6 6 6 6 6 1 1 1 1 1 1 1 1 1 1 1 1 1 1 1 1
symmnumber: 1
zpe: 639096.1 jmol-1
zpe.correction: 0.243419 hartree
zpe.thermalcorrener: 0.265403 hartree
zpe.thermalcorrenthalpy: 0.266347 hartree
zpe.thermalcorrgfe: 0.184140 hartree
zpe.sumelectzpe: -2091.102554 hartree
zpe.sumelectthermal: -2091.080570 hartree
zpe.sumelectthermalent: -2091.079626 hartree
zpe.sumelectthermalfe: -2091.161834 hartree
dipole: 0.0412 5.4182 1.1858
dipole: 5.5466
quadrupole: -80.0586 -128.5121 -123.8314
quadrupole: 4.2858 -21.5130 1.9402
quadrupole: 30.7421 -17.7114 -13.0307 4.2858 -21.5130 1.9402
hfenergy: -2091.3459733 hartree
pointgroup: C01 [X(C10H16N2S4)]
dipole: 0.0462382 -2.1082534 -0.5613602 debye
polarizability: 323.6252801|-7.6914176|180.3472733|-0.0808958|-0.802939|140.1631502 unknown
InChI: InChI=1S/C10H16N2S4/c1-11(2)9(13)15-7-5-6-8-16-10(14)12(3)4/h7-8H2,1-4H3
charge 0 multiplicity 1
32 atoms
S  2.998578 -0.716636 0.76846
S  -3.076253 -1.390266 0.736266
S  4.468063 1.604242 -0.736799
S  -4.765807 1.18504 1.422335
N  5.620184 -0.729052 0.149499
N  -5.44358 -0.76263 -0.387018
C  6.940807 -0.303839 -0.359067
C  5.567452 -2.05054 0.814005
C  -6.730566 -0.090365 -0.667416
C  -5.186923 -2.008246 -1.146497
C  4.508114 0.06846 0.017697
C  -4.559849 -0.264092 0.536979
C  1.703824 0.642078 0.397271
C  -2.001809 -0.385763 1.950998
C  0.412251 0.252559 0.947205
C  -0.699596 -0.047069 1.394856
H  6.846945 0.699514 -0.800677
H  7.297134 -1.010832 -1.131524
H  7.672938 -0.272896 0.469213
H  5.282038 -1.951808 1.878073
H  6.564031 -2.514501 0.756319
H  4.837976 -2.716237 0.316696
H  -7.562588 -0.805571 -0.531824
H  -6.744022 0.289315 -1.706238
H  -6.854854 0.754276 0.025869
H  -5.244469 -2.898273 -0.492004
H  -4.188124 -1.981956 -1.616765
H  -5.94681 -2.099668 -1.938056
H  2.096737 1.574766 0.835135
H  1.681065 0.765652 -0.69812
H  -1.917968 -1.001467 2.861297
H  -2.620719 0.512806 2.174833
