program: Gaussian 09
title: 000002419
version: EM64L-G09RevD.01
frameworkgroup: C1[X(C22H31N3O3)]
method: RPBEPBE
basis: SDD
operation: Freq
keyword: #p
keyword: freq=noraman
keyword: PBEPBE/SDD
title: #p freq=noraman PBEPBE/SDD
converged: YES YES NO NO
title: Mulliken charges:
elementType: O O O N N N C C C C C C C C C C C C C C C C C C C C C C H H H H H H H H H H H H H H H H H H H H H H H H H H H H H H H
charge: -0.226735 -0.221595 -0.311859 -0.183547 -0.080062 -0.186462 0.388403 -0.511734 -0.481345 -0.455819 -0.446789 -0.589162 -0.576639 0.175085 0.166852 -0.395170 -0.340330 -0.378725 -0.383513 -0.417307 -0.405510 0.338380 0.171562 -0.354359 -0.347340 -0.259055 -0.236622 -0.527420 0.210956 0.224244 0.232574 0.206729 0.216093 0.232411 0.228293 0.217307 0.244571 0.256573 0.268325 0.241550 0.257996 0.256135 0.205290 0.235133 0.225473 0.189970 0.179515 0.213693 0.217229 0.268445 0.220167 0.204217 0.244099 0.245551 0.220463 0.226124 0.218693 0.240915 0.228083
chargesum: 0.00000
title: Mulliken charges with hydrogens summed into heavy atoms:
elementType: O O O N N N C C C C C C C C C C C C C C C C C C C C C C
charge: -0.226735 -0.221595 -0.311859 -0.183547 -0.080062 -0.186462 0.388403 -0.076535 -0.042042 -0.007314 -0.001188 -0.088018 -0.066764 0.175085 0.166852 0.118961 0.100093 0.036717 0.009694 0.068367 0.018875 0.338380 0.171562 -0.110260 -0.101789 -0.038592 -0.010498 0.160271
polarizability: 3.64407465e+02 -1.96968815e+00 2.53305630e+02 -1.90819401e+01 1.84848985e+00 1.81601249e+02
1716.lowfreq: -3.2520 -0.0005 0.0007 0.0009 4.6298 9.7073 16.6178 22.2145 24.6905
frequency: 15.9667 21.6279 23.1506 38.8124 58.0597 64.9672 73.3918 75.2922 86.8655 91.5734 102.4279 114.8595 123.8487 142.1201 153.5179 164.4354 191.7831 226.5879 242.5292 252.6367 273.3574 298.9471 311.3111 327.3300 335.4510 345.2833 354.1740 359.8528 371.3722 387.4266 405.7228 435.8112 455.2143 472.2366 486.2518 492.1385 524.1247 543.1437 557.5041 565.4393 576.2226 593.1539 604.4020 626.4199 635.0871 655.7423 696.2396 732.1856 743.5180 754.2177 761.2709 763.2540 770.0423 800.5716 810.5227 826.7876 845.8221 853.3946 885.0895 896.2031 917.3825 920.0160 929.5675 932.9405 940.6151 950.1510 966.6738 968.7729 974.4443 1005.4718 1013.9879 1040.5408 1040.9852 1047.6306 1055.6853 1057.6354 1065.6024 1076.8647 1084.6129 1097.3225 1104.1215 1112.8665 1114.9313 1120.4861 1139.3455 1145.2679 1151.1559 1154.2170 1168.3001 1180.6182 1181.8909 1184.4076 1197.5558 1203.0701 1221.0052 1227.2859 1236.8471 1250.6608 1258.3233 1271.6974 1275.9897 1278.1798 1286.9804 1296.4267 1300.2827 1303.0448 1311.3477 1317.6424 1329.3787 1330.2203 1340.0443 1341.7917 1344.7220 1349.6108 1354.3697 1371.6770 1376.9046 1381.0375 1395.5957 1418.2212 1436.6283 1439.0149 1442.3477 1448.9913 1454.8078 1456.2266 1458.1785 1464.7174 1465.1709 1469.7414 1474.4503 1476.7522 1480.9294 1482.1615 1488.5169 1494.3102 1570.9933 1582.6852 1608.3817 1627.2279 2849.2472 2859.0712 2884.7083 2904.2504 2926.5980 2963.6082 2972.8785 2976.4158 2980.3706 2989.7405 3001.0680 3016.5784 3034.5851 3038.7363 3044.5837 3045.5422 3049.1825 3050.6199 3056.3686 3058.9501 3060.1856 3064.2207 3071.9664 3080.6285 3081.8854 3112.6715 3127.0775 3130.1792 3143.2574 3155.9771 3168.6011
redmass: 4.6988 5.2824 5.1032 4.7991 2.8931 3.1405 3.0003 3.1738 4.0426 4.2626 2.9903 6.1282 3.4738 2.5057 1.9455 1.4573 4.0466 2.3115 2.9324 4.0829 2.3276 3.2596 2.4357 2.8416 3.2722 3.7640 3.7998 2.7130 2.6984 3.0793 2.4857 4.1827 3.9781 3.4258 3.8993 3.4209 6.2003 4.6096 4.3268 3.6040 3.5584 3.7100 3.6164 2.8544 3.0072 2.6560 3.5212 2.8154 3.6140 1.3569 1.9517 1.5247 3.6862 1.9603 2.0929 2.2685 1.5323 1.4994 2.5483 1.8940 4.2570 2.3196 1.5443 2.1747 2.0290 6.6745 1.4849 1.9223 2.1217 2.5668 2.5327 1.6760 2.1566 2.9914 1.8228 2.2830 2.1724 2.6952 2.2577 2.0467 2.3832 2.6097 1.2628 2.1214 1.7800 2.6355 1.5395 1.9828 1.1817 1.8491 1.6812 1.7295 1.3688 1.1292 1.3437 1.5343 1.6951 1.6651 1.4645 1.4831 1.4711 1.4176 1.3355 1.3602 1.3998 1.4432 2.0168 1.5871 1.6672 1.5422 1.8100 1.6354 1.5091 1.6456 1.6914 3.0185 1.5484 1.4841 1.3942 1.3452 1.0775 1.0923 1.8257 1.0901 1.0829 1.0732 1.1032 1.0804 1.0996 1.1100 1.0860 1.0802 1.0688 1.0910 2.6114 1.0951 6.4695 11.0376 6.4366 9.7476 1.0708 1.0704 1.0696 1.0683 1.0698 1.0305 1.0661 1.0664 1.0609 1.0615 1.0621 1.0668 1.0899 1.0993 1.0902 1.0903 1.0997 1.0887 1.1041 1.1041 1.0588 1.0937 1.0934 1.0923 1.1039 1.1020 1.0850 1.1064 1.0893 1.0936 1.1003
irintensity: 0.3560 0.2082 0.0673 0.6224 0.1535 0.3763 0.2233 0.1178 1.5995 1.5856 8.5127 5.4325 0.1819 0.9032 3.3409 2.6571 0.1850 0.2439 5.4491 5.8418 0.3522 15.9423 10.3464 3.3128 2.3283 11.8061 0.9109 5.4784 2.8695 4.5120 4.5183 14.6742 3.3519 2.8596 7.3395 6.5351 4.7973 2.8504 10.1742 5.8393 1.8573 6.7947 14.8335 2.6834 3.0626 2.6767 8.8460 2.1166 7.3427 77.1947 14.6534 4.4863 15.8756 0.5659 4.3810 0.4079 0.1719 0.3396 0.9644 0.1089 45.2725 4.7497 6.2807 1.6491 6.6813 38.4929 0.2162 4.4468 4.9940 54.5823 2.1318 2.7367 25.1205 4.6138 0.7844 10.4103 0.1113 1.1337 1.6435 30.6186 22.3963 1.8968 5.0256 7.5583 118.7462 93.3403 5.6109 13.4400 5.2577 8.4202 23.3808 22.6325 0.9766 1.7691 28.4444 61.5083 146.3429 2.8798 8.0954 8.1632 10.7156 0.2585 1.5964 34.0995 24.4084 18.6955 125.3513 12.0206 19.8949 17.2175 36.3449 15.7556 53.4641 17.3850 6.6011 35.5323 0.7221 54.0959 15.2836 3.8493 5.3555 36.1320 11.3658 8.4873 3.8608 26.0892 33.2574 5.4002 21.9959 12.2321 7.7788 6.6341 4.6857 6.3157 137.6123 8.6894 1.0862 366.2155 47.6567 64.8841 56.6080 73.8612 95.8424 72.9197 96.5764 68.7728 5.8982 13.1880 38.7942 29.0631 30.5252 47.2361 28.6471 31.4155 14.0606 42.6950 9.1296 29.2101 29.4056 2.3927 16.1483 7.3828 15.6964 5.5157 85.3969 23.3063 4.1191 1.6477 15.1018 27.1267 18.2100
temp: 298.150 k
press: 1.00000 atm
elementType: 8 8 8 7 7 7 6 6 6 6 6 6 6 6 6 6 6 6 6 6 6 6 6 6 6 6 6 6 1 1 1 1 1 1 1 1 1 1 1 1 1 1 1 1 1 1 1 1 1 1 1 1 1 1 1 1 1 1 1
symmnumber: 1
zpe: 1313099.6 jmol-1
zpe.correction: 0.500133 hartree
zpe.thermalcorrener: 0.526897 hartree
zpe.thermalcorrenthalpy: 0.527841 hartree
zpe.thermalcorrgfe: 0.440757 hartree
zpe.sumelectzpe: -1244.726805 hartree
zpe.sumelectthermal: -1244.700041 hartree
zpe.sumelectthermalent: -1244.699097 hartree
zpe.sumelectthermalfe: -1244.786181 hartree
dipole: -4.5693 0.1178 2.3982
dipole: 5.1618
quadrupole: -144.3593 -176.4280 -165.2867
quadrupole: -12.3929 3.5337 4.3285
quadrupole: 17.6654 -14.4034 -3.2620 -12.3929 3.5337 4.3285
hfenergy: -1245.2269382 hartree
pointgroup: C01 [X(C22H31N3O3)]
dipole: 1.8035571 0.0440349 -0.9324245 debye
polarizability: 364.6520209|1.2080729|253.3128395|-18.011205|-0.5188719|181.3494837 unknown
InChI: InChI=1S/C22H31N3O3/c1-28-19-7-3-2-6-18(19)24-13-10-23(11-14-24)12-15-25-20(26)16-22(17-21(25)27)8-4-5-9-22/h2-3,6-7H,4-5,8-17H2,1H3
charge 0 multiplicity 1
59 atoms
O  2.383918 2.05715 0.403394
O  3.391733 -2.423289 -0.379477
O  -5.100022 2.229563 0.042431
N  2.908544 -0.18828 0.064948
N  -0.837549 -0.708847 -0.256554
N  -3.706129 -0.328554 -0.160584
C  5.708833 0.476552 -0.100575
C  7.113466 0.868275 -0.640637
C  6.006324 0.249754 1.41338
C  8.12039 -0.039846 0.123212
C  7.400564 -0.442051 1.457196
C  4.654638 1.572462 -0.360747
C  5.195681 -0.820932 -0.774451
C  3.24259 1.194736 0.068653
C  3.788625 -1.225744 -0.350417
C  1.52925 -0.566737 0.480353
C  0.561079 -0.61826 -0.726654
C  -1.417839 0.611612 0.09566
C  -1.737607 -1.426395 -1.188204
C  -2.798604 0.437648 0.742484
C  -3.124899 -1.630311 -0.552486
C  -5.10319 -0.269415 0.108216
C  -5.78276 0.991957 0.210533
C  -5.896041 -1.444255 0.25806
C  -7.155725 1.056744 0.514236
C  -7.279503 -1.374032 0.530709
C  -7.916852 -0.122861 0.68036
C  -4.652702 2.486249 -1.344102
H  7.302181 1.933306 -0.399815
H  7.1897 0.762998 -1.739153
H  5.224506 -0.339671 1.926451
H  6.052899 1.235447 1.91626
H  9.072427 0.487023 0.31022
H  8.365869 -0.938805 -0.470806
H  7.290738 -1.539586 1.523627
H  7.973598 -0.127203 2.346797
H  4.619522 1.811059 -1.444728
H  4.90457 2.513165 0.1604
H  5.848124 -1.686405 -0.568814
H  5.184792 -0.689154 -1.87662
H  1.573037 -1.556223 0.959648
H  1.189369 0.187188 1.20645
H  0.72778 0.279872 -1.370253
H  0.796282 -1.512575 -1.331396
H  -0.747712 1.133193 0.801517
H  -1.514482 1.258812 -0.81358
H  -1.865557 -0.869925 -2.152188
H  -1.299653 -2.415216 -1.417815
H  -2.679303 -0.107453 1.706076
H  -3.248796 1.421678 0.946713
H  -3.788581 -2.115119 -1.29077
H  -3.01824 -2.310907 0.324938
H  -5.419644 -2.427173 0.193163
H  -7.612092 2.048965 0.596343
H  -7.851964 -2.30145 0.645611
H  -8.985776 -0.062326 0.909809
H  -5.528045 2.557747 -2.017919
H  -3.974965 1.685031 -1.692657
H  -4.124798 3.452015 -1.311145
