program: Gaussian 09
title: 000005232
version: EM64L-G09RevD.01
frameworkgroup: C1[X(C10H18N2O4S)]
method: RPBEPBE
basis: SDD
operation: Freq
keyword: #p
keyword: freq=noraman
keyword: PBEPBE/SDD
title: #p freq=noraman PBEPBE/SDD
converged: YES YES NO NO
title: Mulliken charges:
elementType: S O O O O N N C C C C C C C C C C H H H H H H H H H H H H H H H H H H
charge: 0.152495 -0.396234 -0.256034 -0.233519 -0.096819 -0.399410 -0.001030 -0.134583 -0.122812 -0.652474 -0.701846 -0.551520 0.259511 -0.333538 0.127262 -0.342641 -0.693554 0.340268 0.232623 0.220056 0.248693 0.235266 0.232469 0.238909 0.328956 0.231367 0.233310 0.215889 0.214035 0.189095 0.190009 0.213017 0.213423 0.214865 0.384496
chargesum: 0.00000
title: Mulliken charges with hydrogens summed into heavy atoms:
elementType: S O O O O N N C C C C C C C C C C
charge: 0.152495 -0.011738 -0.256034 -0.233519 -0.096819 -0.070454 -0.001030 -0.134583 0.217456 0.048897 0.004798 -0.086842 0.259511 0.096386 0.127262 0.036462 -0.052248
polarizability: 1.81492210e+02 -1.00091554e+01 1.65700967e+02 4.94788889e+00 -1.56719956e+01 1.41454766e+02
1716.lowfreq: -40.0921 0.0008 0.0013 0.0021 7.2534 8.5028 11.9081 32.2224 40.2778
frequency: -39.8522 32.1867 40.1974 51.5191 64.7662 81.1487 84.4601 92.8756 107.0080 115.8747 140.7352 162.8411 214.2907 217.2543 223.6066 235.9244 239.6747 249.7036 264.2788 274.6572 298.6028 308.4414 325.6621 360.2484 375.0417 396.8898 449.8390 520.8745 540.9487 576.5955 590.6881 599.5826 618.1068 641.6090 677.8184 710.6460 725.9525 793.0517 813.0743 888.7510 899.6130 921.6129 934.5720 944.8340 964.4215 1009.5803 1029.1258 1053.9464 1082.3247 1094.0263 1101.7256 1126.4396 1132.0189 1174.4881 1196.0262 1204.6380 1206.9771 1250.6402 1264.8530 1277.6325 1287.0318 1318.4011 1328.4979 1345.0707 1360.4239 1383.9649 1391.4906 1403.6400 1439.9799 1453.7553 1461.5798 1465.7141 1470.7686 1474.9391 1476.9387 1477.7390 1483.5681 1487.6913 1542.9057 1602.5486 1643.1925 2959.9202 2963.2035 2975.1559 2983.9175 2989.0444 3000.6202 3003.9871 3011.9404 3058.5580 3061.3615 3073.8756 3074.1248 3078.3210 3084.5592 3092.9467 3103.0367 3498.6285 3531.1073
redmass: 1.8144 4.9784 3.8614 7.9610 6.7313 5.6097 6.7296 3.6221 2.0255 5.9143 6.2635 4.1390 2.6185 1.8846 4.2832 1.1989 2.3575 2.0070 1.6386 4.8467 3.7930 5.1843 4.7628 3.6985 4.7282 3.4494 2.9101 3.3870 2.8647 3.5228 3.2827 1.3451 4.7269 1.8145 4.3596 3.6693 1.1068 1.2963 4.0804 4.4672 1.8574 1.3008 1.8178 1.9930 2.9751 1.4337 3.5908 2.6451 2.4945 2.0465 1.4959 2.1743 2.6312 2.8671 2.4056 1.8754 1.4877 1.4482 1.5035 1.1801 1.0564 1.3292 1.6096 1.8975 1.7535 1.1964 1.2172 1.1961 1.1157 1.0589 1.1208 1.0713 1.0527 1.1254 1.4174 1.0423 1.1163 1.0793 13.9519 6.0679 7.9085 1.0593 1.0591 1.0360 1.0362 1.0363 1.0610 1.0987 1.0998 1.0841 1.1030 1.0995 1.1013 1.0984 1.0981 1.0998 1.1003 1.0639 1.0773
irintensity: 0.0169 0.1878 0.7704 1.1911 1.2750 1.9234 3.2182 5.4917 4.6883 1.8232 0.5594 5.6111 1.7996 3.0364 0.9511 0.3338 2.7207 0.5015 0.5849 7.9240 4.5219 13.0073 2.3720 7.0168 13.9604 12.5925 3.3297 41.4502 14.7375 27.2039 28.9856 43.5381 59.1111 137.8041 8.1481 17.5376 13.3837 0.1782 0.5867 3.8302 10.3158 3.7898 4.0765 4.9656 6.1335 0.2158 37.4674 183.7149 19.5896 10.8717 0.4002 16.1580 17.6176 12.5635 25.2838 33.5812 3.5944 5.0219 18.6202 0.1596 0.2377 20.9855 29.3704 141.7147 14.5671 38.1923 12.7843 13.8163 18.0353 9.9869 25.1790 2.1588 22.6192 29.6766 87.6656 12.8982 42.8567 16.1820 464.6896 184.7631 158.0560 16.2297 35.8381 34.0527 14.6254 23.8483 24.9998 17.9465 1.4774 12.6329 6.8022 51.2934 96.2027 7.0470 30.7308 17.1046 14.4814 30.2534 31.8866
temp: 298.150 k
press: 1.00000 atm
elementType: 16 8 8 8 8 7 7 6 6 6 6 6 6 6 6 6 6 1 1 1 1 1 1 1 1 1 1 1 1 1 1 1 1 1 1
symmnumber: 1
zpe: 728639.9 jmol-1
zpe.correction: 0.277524 hartree
zpe.thermalcorrener: 0.297647 hartree
zpe.thermalcorrenthalpy: 0.298591 hartree
zpe.thermalcorrgfe: 0.227977 hartree
zpe.sumelectzpe: -1198.934585 hartree
zpe.sumelectthermal: -1198.914462 hartree
zpe.sumelectthermalent: -1198.913518 hartree
zpe.sumelectthermalfe: -1198.984132 hartree
dipole: 1.6611 -3.3517 1.6756
dipole: 4.0988
quadrupole: -95.2799 -116.3108 -110.2560
quadrupole: -0.6645 -5.1227 5.8872
quadrupole: 12.0023 -9.0285 -2.9738 -0.6645 -5.1227 5.8872
hfenergy: -1199.2121095 hartree
pointgroup: C01 [X(C10H18N2O4S1)]
dipole: -0.485907 1.2530541 0.8912001 debye
polarizability: 178.5824969|-11.820601|162.0521264|-3.770417|19.7206502|148.0133198 unknown
InChI: InChI=1S/C10H18N2O4S/c1-4-5-6-7(13)11-8(9(14)15)10(2,3)17-12-16/h8,11,14H,4-6H2,1-3H3
charge 0 multiplicity 1
35 atoms
S  -1.551803 -1.900139 0.698365
O  -2.551865 2.489341 -1.29612
O  1.042201 -0.518806 -1.20951
O  -1.424546 3.137845 0.624428
O  -0.899848 -3.028685 -1.791678
N  0.08685 0.793766 0.455092
N  -1.340305 -1.985833 -1.328969
C  -2.285123 -0.116199 0.636681
C  -1.249476 0.791592 -0.142612
C  -3.64745 -0.172177 -0.084761
C  -2.438931 0.308554 2.112358
C  2.502382 0.350321 0.586422
C  1.16896 0.160518 -0.145173
C  3.663555 -0.431928 -0.056979
C  -1.727203 2.245229 -0.201302
C  5.003984 -0.197445 0.67433
C  6.171004 -0.981233 0.036048
H  -1.157904 0.395789 -1.168579
H  -4.304486 -0.904776 0.414518
H  -4.146727 0.813829 -0.063545
H  -3.529169 -0.472798 -1.139492
H  -2.852082 1.33238 2.179494
H  -1.473203 0.286724 2.646828
H  -3.131435 -0.373783 2.634909
H  0.238448 1.405632 1.261031
H  2.744028 1.433607 0.608161
H  2.375387 0.038799 1.64364
H  3.756411 -0.138794 -1.119587
H  3.419906 -1.511236 -0.060132
H  5.242088 0.88645 0.671412
H  4.901463 -0.491018 1.739597
H  6.314766 -0.686141 -1.020291
H  5.973627 -2.069461 0.054638
H  7.121304 -0.800004 0.570929
H  -2.83981 3.443683 -1.292652
