program: Gaussian 09
title: 000005208
version: EM64L-G09RevD.01
frameworkgroup: C1[X(C16H16O5)]
method: RPBEPBE
basis: SDD
operation: Freq
keyword: #pfreq=noraman
keyword: PBEPBE/SDD
title: #p freq=noraman PBEPBE/SDD
converged: YES YES NO NO
title: Mulliken charges:
elementType: O O O O O C C C C C C C C C C C C C C C C H H H H H H H H H H H H H H H H
charge: -0.438776 -0.373096 -0.368326 -0.325518 -0.371227 -0.282597 0.537642 -0.509709 0.134713 0.031559 0.055456 -0.632692 0.143526 -0.275889 0.098649 0.135893 0.364593 -0.315023 -0.310994 -0.782002 -0.790039 0.252644 0.236158 0.217538 0.278363 0.249743 0.271713 0.271788 0.372857 0.234088 0.215923 0.216777 0.221289 0.224367 0.223333 0.399164 0.388114
chargesum: 0.00000
title: Mulliken charges with hydrogens summed into heavy atoms:
elementType: O O O O O C C C C C C C C C C C C C C C C
charge: -0.065919 -0.373096 0.030838 -0.325518 0.016887 -0.029953 0.537642 -0.056014 0.134713 0.031559 0.055456 -0.354329 0.143526 -0.026146 0.098649 0.135893 0.364593 -0.043310 -0.039206 -0.115213 -0.121050
polarizability: 3.72584011e+02 -1.58031040e+00 2.14383549e+02 -1.85880295e+01 7.40650843e+00 1.17691696e+02
1716.lowfreq: -8.2779 -2.5730 -0.0008 0.0003 0.0004 2.7766 24.7217 32.0226 42.2065
frequency: 24.6348 31.9330 42.1091 66.9694 92.0613 124.7395 131.8125 134.1072 162.2141 180.8683 185.1758 195.7678 233.0205 249.3522 281.7574 294.6555 320.6455 343.5591 359.8549 381.7872 417.1681 420.8564 432.7797 439.6746 452.7045 470.2692 477.1951 482.4557 511.2212 527.4026 576.9213 586.3079 595.4712 647.6031 677.6032 711.8170 723.3087 736.0822 764.5874 783.1260 837.2538 845.7745 862.2301 898.2149 911.3714 939.0237 947.8333 966.3182 971.6846 975.5513 987.0460 997.6883 1010.5531 1018.6412 1047.6801 1081.1313 1120.7845 1123.3388 1147.7666 1172.0890 1210.1772 1221.3169 1241.7006 1246.9026 1278.7803 1281.3933 1292.2225 1306.6050 1337.6331 1358.5719 1361.3168 1388.5563 1398.4646 1400.3871 1405.0239 1417.2972 1444.1255 1449.7925 1451.1415 1455.9566 1466.6553 1472.3661 1475.2385 1513.8282 1538.4008 1585.0233 1593.9971 1632.0572 1687.4284 2551.9400 2624.3849 2958.6740 2964.8680 2971.9003 3029.7799 3033.6294 3039.9885 3056.3911 3083.3853 3090.3274 3101.1352 3146.4604 3167.4212 3187.3160 3441.3867
redmass: 4.2778 4.7828 3.1469 3.8066 4.2144 1.6820 1.8631 6.5674 7.1789 4.0024 1.3166 6.4537 5.6983 4.4408 4.9542 2.4245 5.5760 5.0828 5.6283 2.6196 10.7479 5.2075 6.0740 3.0903 9.1804 5.7714 3.9541 5.1020 3.8334 2.8371 2.5805 1.4377 3.7683 4.7666 4.3203 6.3755 5.8601 5.8580 6.4979 2.9652 1.6201 2.2127 1.7433 5.3026 1.6087 6.3152 1.4009 1.3605 1.6379 1.2795 1.0778 1.2694 4.9249 2.8752 2.1497 1.6718 1.7448 2.0978 1.4222 1.9166 1.5242 1.9364 1.8948 1.6046 2.9491 1.6384 6.3124 1.2821 2.1696 2.0553 1.6204 1.2845 1.5653 1.5326 2.5692 3.7979 2.2283 1.1417 7.4053 1.0540 1.0516 1.0448 1.0894 7.0331 2.9002 3.5501 3.0228 7.4269 6.3288 1.0752 1.0725 1.0375 1.0387 1.0628 1.0969 1.0963 1.0908 1.0910 1.0981 1.0957 1.0896 1.0922 1.0885 1.0982 1.0651
irintensity: 0.2157 0.2754 0.0366 2.4608 0.3539 2.5020 0.7209 1.1308 4.3583 1.4362 0.7583 1.7034 1.4214 0.3649 0.5360 1.3703 4.7091 0.5802 0.0709 0.6738 0.5707 1.3459 2.3899 6.0139 22.7179 17.0815 6.6589 4.5729 11.6913 13.0230 26.6899 195.4393 68.8550 12.4323 2.8410 1.3188 11.4199 0.6548 3.7408 2.7062 63.8471 11.4511 25.0768 5.7914 18.6659 19.4831 1.0594 23.0276 46.9238 91.5375 117.7583 9.0230 40.1152 0.7562 19.2942 2.8210 4.0941 28.8100 32.8046 10.0567 80.1305 18.2532 167.0915 197.8562 31.1595 86.4405 82.3209 8.8480 109.9827 63.4300 28.7402 19.1860 37.2240 50.5037 106.5806 9.6287 263.3865 19.8934 2.8889 0.1430 10.4364 27.3102 18.8452 219.3084 146.4517 32.9995 5.2394 53.8792 82.3820 64.6772 52.6682 43.1029 65.4235 15.5082 7.1714 43.8237 9.3228 25.4878 23.2191 30.6526 35.6071 4.0990 0.2588 3.3145 71.3578
temp: 298.150 k
press: 1.00000 atm
elementType: 8 8 8 8 8 6 6 6 6 6 6 6 6 6 6 6 6 6 6 6 6 1 1 1 1 1 1 1 1 1 1 1 1 1 1 1 1
symmnumber: 1
zpe: 744644.9 jmol-1
zpe.correction: 0.283620 hartree
zpe.thermalcorrener: 0.303151 hartree
zpe.thermalcorrenthalpy: 0.304096 hartree
zpe.thermalcorrgfe: 0.234992 hartree
zpe.sumelectzpe: -993.900702 hartree
zpe.sumelectthermal: -993.881171 hartree
zpe.sumelectthermalent: -993.880227 hartree
zpe.sumelectthermalfe: -993.949330 hartree
dipole: -0.0565 -0.1204 -2.2113
dipole: 2.2153
quadrupole: -111.0632 -133.7662 -128.4554
quadrupole: -12.3281 2.5746 0.6730
quadrupole: 13.3650 -9.3379 -4.0271 -12.3281 2.5746 0.6730
hfenergy: -994.1843224 hartree
pointgroup: C01 [X(C16H16O5)]
dipole: 0.0142668 0.0718151 -0.8684997 debye
polarizability: 372.8689154|-3.764988|214.785437|15.9312065|-4.801422|117.0049037 unknown
InChI: InChI=1S/C16H16O5/c1-8(2)3-4-10(17)9-7-13(20)14-11(18)5-6-12(19)15(14)16(9)21/h3,5-7,10,17-19H,4H2,1-2H3
charge 0 multiplicity 1
37 atoms
O  2.109368 1.133036 1.978399
O  0.103945 2.140979 0.341223
O  -2.135625 3.067053 -0.372087
O  -1.97011 -2.971769 0.476667
O  -4.237805 -2.099326 -0.23402
C  1.945938 0.02768 1.025287
C  0.473399 -0.231386 0.731253
C  2.751849 0.279885 -0.291895
C  -1.780033 0.68948 0.03112
C  -0.384458 0.920608 0.364922
C  -2.323058 -0.63137 0.063402
C  -0.07601 -1.49766 0.77002
C  -1.478612 -1.761534 0.440162
C  4.23594 0.369185 -0.01368
C  -2.617454 1.79058 -0.330637
C  -3.692919 -0.848032 -0.262793
C  5.246713 -0.301296 -0.640675
C  -3.994799 1.557929 -0.659226
C  -4.521009 0.267913 -0.627048
C  6.692973 -0.081683 -0.223913
C  5.063506 -1.286747 -1.78199
H  2.375169 -0.848234 1.541453
H  2.380542 1.228813 -0.731274
H  2.522228 -0.523503 -1.015908
H  0.530928 -2.366696 1.049233
H  4.496989 1.059105 0.801945
H  -4.611719 2.418313 -0.932911
H  -5.568668 0.074004 -0.874039
H  1.676089 1.931314 1.563731
H  6.775841 0.643045 0.603993
H  7.298939 0.293341 -1.072875
H  7.16061 -1.032384 0.101994
H  5.517496 -2.26505 -1.527318
H  5.583284 -0.927214 -2.692398
H  4.007694 -1.460959 -2.046377
H  -1.127419 3.018179 -0.098935
H  -3.469042 -2.754102 0.056996
