program: Gaussian 09
title: 000005173
version: EM64L-G09RevD.01
frameworkgroup: C1[X(C8H16N2O4)]
method: RPBEPBE
basis: SDD
operation: Freq
keyword: #p
keyword: freq=noraman
keyword: PBEPBE/SDD
title: #p freq=noraman PBEPBE/SDD
converged: YES YES NO NO
title: Mulliken charges:
elementType: O O O O N N C C C C C C C C H H H H H H H H H H H H H H H H
charge: -0.330899 -0.331245 -0.380132 -0.379955 -0.325114 -0.325402 -0.369744 -0.369683 -0.380803 -0.380782 -0.501361 -0.501227 0.299355 0.299807 0.175803 0.250901 0.251247 0.175639 0.212371 0.208765 0.212266 0.208728 0.230685 0.200848 0.200826 0.230702 0.332220 0.332212 0.377004 0.376971
chargesum: 0.00000
title: Mulliken charges with hydrogens summed into heavy atoms:
elementType: O O O O N N C C C C C C C C
charge: -0.330899 -0.331245 -0.003129 -0.002984 0.007106 0.006810 0.056960 0.057203 0.040333 0.040212 -0.069828 -0.069700 0.299355 0.299807
polarizability: 1.37131459e+02 -2.38605481e-02 1.14893862e+02 1.39116987e+01 -5.41382933e-02 1.03003875e+02
1716.lowfreq: -19.1982 -2.7841 0.0005 0.0006 0.0008 2.7587 15.8972 21.1578 23.0761
frequency: 15.8347 21.1012 22.9834 46.6439 68.1097 98.3190 119.5753 131.3664 153.4737 165.6698 191.4620 247.9509 252.0241 263.6786 303.2979 335.3306 359.4654 386.3609 387.9428 448.5619 483.2609 521.1384 521.6160 596.7729 599.4367 698.1967 700.4697 735.1638 794.9599 839.1492 848.7146 890.4216 909.4744 934.6482 984.8456 988.9823 991.9486 1026.1977 1062.2285 1071.9684 1080.6874 1096.1815 1125.6255 1153.9614 1188.2068 1229.8885 1232.2088 1244.5984 1275.9188 1288.2894 1293.7460 1311.8500 1317.4832 1319.1302 1342.1488 1355.4548 1376.2868 1376.8469 1452.3659 1452.7141 1462.1641 1465.9580 1473.4329 1488.8677 1488.9976 1489.4163 1569.6213 1570.6089 2961.5518 2962.3862 2970.3596 2972.3055 2985.6738 2985.8485 3018.9400 3020.7476 3039.7672 3047.8264 3049.7858 3062.8795 3207.8981 3208.1045 3620.6080 3621.4393
redmass: 7.7792 4.9506 7.6394 5.6704 3.9985 1.7374 3.8446 3.6958 3.0279 4.8022 5.5510 2.9745 3.1546 4.5767 3.4962 2.7488 3.5363 1.6062 1.4236 2.0982 1.9112 1.1853 1.1762 3.2506 3.2310 2.4618 2.5584 1.2232 1.5708 1.8623 2.3655 2.2175 3.7885 2.7317 3.0012 3.4348 3.6439 3.0880 2.9013 2.2177 2.1125 2.1636 1.3483 1.2718 1.4504 1.3666 1.3319 1.2869 1.2159 1.2692 1.0487 1.2230 1.3545 1.3495 1.6222 1.7376 1.8418 1.8975 1.1249 1.1237 1.0798 1.0680 1.0880 1.5277 2.0170 1.3509 3.2980 3.3621 1.0653 1.0635 1.0604 1.0623 1.0608 1.0608 1.0931 1.0987 1.0990 1.1006 1.1013 1.1020 1.0629 1.0629 1.0831 1.0831
irintensity: 0.3990 4.9867 4.1590 0.0234 8.5819 0.1669 0.0079 3.5917 1.4951 4.5460 0.6594 49.3681 34.3165 21.4149 4.4338 0.1742 51.2972 55.5237 68.0098 9.7769 77.3039 163.3687 126.6882 5.6109 3.8043 5.3857 9.1331 4.9528 6.0035 0.0505 0.9267 1.2345 9.0954 46.5438 53.6756 54.1827 54.3448 13.8961 18.9271 10.0601 7.0591 7.6181 0.1658 41.3413 7.5192 8.6160 7.2508 9.4600 7.2793 4.4601 5.3203 2.4132 0.4638 56.0332 92.8717 83.7653 58.3265 92.7849 22.4812 21.5359 4.1134 0.7030 0.0530 76.2157 1.5976 111.4768 90.3627 94.5220 6.8789 16.9881 0.0081 89.6191 48.6222 25.2988 1.0665 27.5117 16.8611 1.8887 33.3683 87.3986 23.2075 39.0719 75.2895 61.6264
temp: 298.150 k
press: 1.00000 atm
elementType: 8 8 8 8 7 7 6 6 6 6 6 6 6 6 1 1 1 1 1 1 1 1 1 1 1 1 1 1 1 1
symmnumber: 1
zpe: 642858.4 jmol-1
zpe.correction: 0.244852 hartree
zpe.thermalcorrener: 0.261642 hartree
zpe.thermalcorrenthalpy: 0.262586 hartree
zpe.thermalcorrgfe: 0.196635 hartree
zpe.sumelectzpe: -723.636450 hartree
zpe.sumelectthermal: -723.619660 hartree
zpe.sumelectthermalent: -723.618716 hartree
zpe.sumelectthermalfe: -723.684667 hartree
dipole: 0.0118 -3.9762 -0.0122
dipole: 3.9762
quadrupole: -81.4603 -86.0865 -84.1177
quadrupole: -0.0670 21.7067 0.0121
quadrupole: 2.4278 -2.1983 -0.2296 -0.0670 21.7067 0.0121
hfenergy: -723.8813021 hartree
pointgroup: C01 [X(C8H16N2O4)]
dipole: 0.0071287 1.5639006 0.0375609 debye
polarizability: 134.7628065|0.2660006|114.8786911|-16.3904299|0.4381974|105.3876992 unknown
InChI: InChI=1S/C8H16N2O4/c11-7(9-13)5-3-1-2-4-6-8(12)10-14/h9-10,13-14H,1-6H2
charge 0 multiplicity 1
30 atoms
O  3.315559 -0.654006 1.008631
O  -3.31983 -0.556188 -1.090245
O  5.008816 -2.162719 -0.336829
O  -5.050986 -2.094032 0.171381
N  4.552526 -0.91116 -0.88019
N  -4.57574 -0.878535 0.776118
C  0.757597 1.118837 0.189081
C  -0.74083 1.139641 -0.185491
C  1.668626 1.138057 -1.058731
C  -1.652624 1.109461 1.061499
C  3.190386 1.133056 -0.735795
C  -3.173833 1.143658 0.738057
C  3.669133 -0.174803 -0.129515
C  -3.672227 -0.124913 0.067699
H  0.996642 1.996343 0.826652
H  0.988779 0.22419 0.796648
H  -0.985566 0.280561 -0.837397
H  -0.966016 2.051932 -0.777756
H  1.426283 0.273114 -1.708022
H  1.452854 2.048051 -1.654274
H  -1.424185 0.209196 1.666384
H  -1.423788 1.984722 1.702452
H  3.41166 1.938141 -0.009066
H  3.767807 1.353127 -1.655514
H  -3.749022 1.326718 1.667238
H  -3.381813 1.987167 0.052064
H  4.954144 -0.716046 -1.794668
H  -4.978456 -0.720595 1.697344
H  4.508738 -2.162917 0.547332
H  -4.544434 -2.061456 -0.708487
