program: Gaussian 09
title: 000005147
version: EM64L-G09RevD.01
frameworkgroup: C1[X(C7H7NO2)]
method: RPBEPBE
basis: SDD
operation: Freq
keyword: #pfreq=noraman
keyword: PBEPBE/SDD
title: #p freq=noraman PBEPBE/SDD
converged: YES YES NO NO
title: Mulliken charges:
elementType: O O N C C C C C C C H H H H H H H
charge: -0.404980 -0.237758 -0.616565 0.185785 0.153323 -0.348623 -0.385761 -0.248680 -0.197056 0.147664 0.255066 0.220838 0.232476 0.230570 0.324102 0.332362 0.357240
chargesum: 0.00000
title: Mulliken charges with hydrogens summed into heavy atoms:
elementType: O O N C C C C C C C
charge: -0.047740 -0.237758 0.039898 0.185785 0.153323 -0.093558 -0.164923 -0.016204 0.033514 0.147664
polarizability: 1.12800382e+02 1.66291068e+00 9.76484504e+01 -3.71864371e-02 1.77886748e+00 4.68587627e+01
1716.lowfreq: -10.0767 -7.9486 -6.1784 0.0005 0.0006 0.0007 50.2052 110.8839 173.4628
frequency: 50.1456 110.8818 173.4624 215.7743 311.9786 343.9221 370.4793 423.6180 482.1698 507.8232 520.4768 562.5508 590.6866 595.4778 696.4592 715.4920 756.1494 764.0226 820.8356 849.6434 942.1139 977.0107 1036.4403 1046.7095 1068.3843 1131.7298 1154.4542 1173.3570 1251.5505 1291.5486 1330.0055 1389.5495 1427.9709 1491.3615 1583.5563 1597.4493 1608.7195 1636.0568 3114.8889 3132.7584 3146.4410 3169.2329 3514.2040 3575.7621 3673.2055
redmass: 5.8713 4.6270 6.1795 4.7773 4.1872 1.1693 4.2036 4.0269 2.5460 1.3810 2.9986 3.9245 1.3857 4.5277 4.1915 3.8207 1.6668 2.8148 6.0989 1.4553 1.3683 1.3194 2.4818 2.3856 2.1307 2.1356 1.2360 1.0567 2.6719 1.4325 4.2988 7.5815 2.3263 2.6485 1.8524 3.3109 6.6936 3.7378 1.0885 1.0877 1.0931 1.1004 1.0445 1.0661 1.1045
irintensity: 9.4601 7.0858 2.7113 4.4327 4.5763 124.9504 7.9592 9.0416 47.1102 98.6013 33.9283 11.5901 79.4937 21.7228 15.9283 27.1626 80.6643 13.5009 30.2307 0.4720 3.1121 0.2257 5.7953 13.7967 66.8355 59.2885 62.6755 1.9464 24.4486 42.8005 213.0968 8.0317 34.0805 22.6518 71.7330 41.2107 35.0166 299.2328 12.8535 1.3242 18.9463 19.5096 33.6795 35.6270 22.1189
temp: 298.150 k
press: 1.00000 atm
elementType: 8 8 7 6 6 6 6 6 6 6 1 1 1 1 1 1 1
symmnumber: 1
zpe: 336907.3 jmol-1
zpe.correction: 0.128321 hartree
zpe.thermalcorrener: 0.137262 hartree
zpe.thermalcorrenthalpy: 0.138206 hartree
zpe.thermalcorrgfe: 0.094172 hartree
zpe.sumelectzpe: -475.429034 hartree
zpe.sumelectthermal: -475.420093 hartree
zpe.sumelectthermalent: -475.419149 hartree
zpe.sumelectthermalfe: -475.463183 hartree
dipole: -2.9078 -1.5893 -2.9282
dipole: 4.4222
quadrupole: -52.9629 -46.7933 -61.6167
quadrupole: -10.8989 -7.1279 -0.3040
quadrupole: 0.8280 6.9977 -7.8257 -10.8989 -7.1279 -0.3040
hfenergy: -475.5573552 hartree
pointgroup: C01 [X(C7H7N1O2)]
dipole: -1.1021133 0.6020864 1.2040749 debye
dipolederiv: -0.3001945 0.564152 -0.0955783 0.4668424 -1.0577872 0.1185238 -0.0995501 0.1421466 -0.4057695 -0.8362515 0.1438465 0.2334285 0.0336949 -0.5539308 -0.2803361 0.0515072 -0.3005173 -0.6926244 -0.6023897 -0.2900065 -0.3508742 -0.2397295 -0.8707097 -0.1510106 -0.2858215 -0.1046301 -0.696772 -0.3323687 -0.1267879 0.0463619 0.1929299 -0.2293421 -0.0168146 -0.0275499 -0.0131468 -0.0926803 0.2914695 -0.5444105 0.0905836 -0.3757767 1.0341738 -0.1809544 0.1156512 -0.1578984 0.1044048 0.1612073 0.0392181 -0.0218097 -0.1654326 0.0604307 -0.0444935 -0.0807971 -0.063443 -0.1183321 -0.1757038 0.3697089 -0.075315 0.0162002 -0.1142752 -0.0160632 -0.0217023 -0.0238144 -0.1914695 -0.224846 -0.1242151 0.0137122 -0.1391492 -0.0614139 -0.0101347 0.0220298 -0.0130426 -0.1872568 0.112597 -0.0461321 -0.0043869 0.1199371 0.1741066 -0.0548834 -0.0274588 -0.0481024 -0.1193576 1.4238936 0.2523578 -0.0012096 0.2745261 0.8534421 0.687949 0.1365791 0.6311932 0.9190829 0.0519052 -0.087817 0.0241254 -0.0676077 -0.0298642 0.0353016 0.0346138 0.0324903 0.1340102 0.0459117 -0.0441417 0.0155807 -0.0784364 -0.1016543 0.0516226 0.0215808 0.0547985 0.1617222 0.0155541 0.0837984 -0.0035828 0.0981209 -0.0539198 0.0310235 -0.0030121 0.0349154 0.1677311 -0.1202418 -0.0020862 0.0159953 -0.0089988 0.0920079 0.0123181 0.0178026 0.0065425 0.1554222 0.1949655 0.0135843 0.0541535 0.0255071 0.2765166 -0.0949013 0.0826932 -0.0904783 0.2244812 0.157434 -0.0143518 0.0333951 -0.0384637 0.2736406 -0.0977736 0.0392676 -0.0912424 0.2602108 0.137058 -0.1867172 0.0254205 -0.1141641 0.3085789 0.0106269 0.0241667 0.0042292 0.3771965 unknown
polarizability: 112.6486257|-0.7603686|97.5638718|-4.4210757|-0.2582586|47.0950974 unknown
InChI: InChI=1S/C7H7NO2/c8-7(10)5-3-1-2-4-6(5)9/h1-4,9H,8H2
charge 0 multiplicity 1
17 atoms
O  0.354419 -2.083867 0.251195
O  2.378207 -0.383174 -1.215021
N  2.414363 1.270208 0.416421
C  0.261581 0.28785 -0.173594
C  -0.422893 -0.935384 0.065584
C  -0.502562 1.474144 -0.305702
C  -1.836388 -0.961305 0.154566
C  -1.912768 1.45654 -0.221115
C  -2.577587 0.230558 0.006376
C  1.761164 0.329682 -0.373963
H  0.018152 2.41632 -0.511953
H  -2.354421 -1.910502 0.344771
H  -2.483191 2.382895 -0.341041
H  -3.670561 0.19838 0.070789
H  1.933716 1.766779 1.164486
H  3.42278 1.378123 0.307045
H  -0.21721 -2.883948 0.363655
