program: Gaussian 09
title: 000005379
version: EM64L-G09RevD.01
frameworkgroup: C1[X(C19H22FN3O4)]
method: RPBEPBE
basis: SDD
operation: Freq
keyword: #p
keyword: freq=noraman
keyword: PBEPBE/SDD
title: #p freq=noraman PBEPBE/SDD
converged: YES YES NO NO
title: Mulliken charges:
elementType: F O O O O N N N C C C C C C C C C C C C C C C C C C C H H H H H H H H H H H H H H H H H H H H H H
charge: -0.198358 -0.316153 -0.225127 -0.384165 -0.287651 -0.172739 -0.195411 -0.259451 -0.094674 -0.527130 -0.472154 0.198689 -0.335126 0.132600 0.213996 0.182400 -0.370672 -0.111842 -0.351082 -0.463609 0.108731 0.057076 -0.640036 0.227810 -0.727421 0.098790 -0.538741 0.271976 0.253177 0.252234 0.257742 0.244138 0.306997 0.203049 0.254247 0.229850 0.227098 0.214752 0.227081 0.207121 0.246723 0.310348 0.215115 0.202175 0.245729 0.227055 0.246316 0.232286 0.376240
chargesum: 0.00000
title: Mulliken charges with hydrogens summed into heavy atoms:
elementType: F O O O O N N N C C C C C C C C C C C C C C C C C C C
charge: -0.198358 -0.316153 -0.225127 -0.007925 -0.287651 -0.172739 -0.195411 -0.012727 0.177302 -0.021719 0.029726 0.198689 -0.028129 0.132600 0.213996 0.182400 0.086624 0.118008 0.090768 -0.029407 0.108731 0.057076 -0.329688 0.227810 -0.064403 0.098790 0.166916
polarizability: 3.90733939e+02 -6.48228958e+00 2.55091970e+02 5.11883562e+00 8.19725086e+00 1.48075180e+02
1716.lowfreq: -3.8658 -0.0005 0.0008 0.0009 4.5993 8.0720 28.5823 34.5925 38.9535
frequency: 27.8042 34.5436 38.9083 48.6306 52.6461 67.1834 82.7253 93.5788 100.8670 125.6009 134.1577 155.3282 159.5192 163.6794 178.6582 205.7177 211.5500 221.8233 234.5696 254.2889 267.4369 280.5588 303.0272 327.2929 344.1239 346.4609 360.8315 365.5305 375.6863 386.2596 417.6143 424.0231 440.0777 458.7508 472.4836 494.2586 525.0804 541.3062 548.9203 568.5488 598.6915 604.3211 634.6800 641.1311 651.4918 691.7617 706.8886 720.8329 747.1986 763.2767 786.1502 795.2471 804.4747 830.3723 835.0416 871.6728 878.7675 886.2624 899.1543 918.2045 921.3571 945.2052 965.4165 970.0187 977.7968 999.9408 1009.6022 1023.4201 1054.6286 1059.1144 1067.3740 1078.9827 1096.4271 1103.1690 1104.7517 1108.8620 1128.3653 1139.8677 1144.3933 1150.0104 1163.6499 1171.1233 1185.5977 1198.0158 1206.7131 1217.5202 1267.7423 1272.4865 1275.1184 1297.9131 1320.1350 1324.1529 1339.3879 1348.5248 1353.0047 1355.7259 1359.6388 1368.8106 1374.7059 1382.2620 1387.1342 1418.8114 1435.9463 1439.2745 1441.5136 1446.0967 1449.1743 1454.5670 1459.1731 1466.3628 1470.1039 1473.1544 1475.4843 1478.9568 1532.3365 1554.4254 1585.0549 1610.9925 1622.3247 2900.7401 2936.3534 2969.2293 2975.5661 2983.6386 2987.8034 3056.5323 3067.2092 3069.0937 3075.6309 3091.2528 3096.1630 3105.0919 3113.6962 3116.6569 3155.8655 3163.3220 3171.6295 3204.6880 3222.9031 3412.8370 3494.3683
redmass: 5.8213 10.6922 4.2810 4.7468 6.3707 4.1316 3.1007 3.4523 3.5193 4.7152 3.8163 2.5769 1.3121 3.0955 3.6487 4.1365 2.5410 1.5179 3.3013 5.2215 7.9894 2.8692 4.8758 2.8832 3.3888 5.3289 8.3551 4.6616 5.2696 6.7974 4.2472 6.6505 3.1748 2.0805 3.9259 5.6596 4.9852 4.1624 2.4001 3.7290 3.0987 2.0604 4.4736 3.1253 2.8683 3.2026 4.8203 4.1552 7.3500 1.5595 3.3696 6.4867 2.6821 1.6840 1.7207 4.7811 2.5818 2.0837 1.9690 1.4445 2.8026 4.0310 2.3798 1.4308 2.7621 8.5754 3.1855 1.7080 1.2400 2.6447 2.8299 1.1805 1.3149 2.0327 1.4852 2.5217 1.7550 2.2700 1.3890 2.9051 1.3685 2.1378 2.5288 2.1121 1.4429 1.9439 2.6135 2.1157 1.4035 1.5069 2.1983 1.7255 1.3335 1.7416 1.8937 1.3123 1.8346 4.7632 2.2590 3.2143 1.2819 1.2958 1.5920 1.1019 1.3324 1.3400 1.2437 1.0939 1.1629 1.3257 1.3369 1.1426 1.9789 1.0724 8.9764 8.7221 7.6465 9.1225 7.9467 1.0705 1.0688 1.0307 1.0408 1.0636 1.0789 1.1011 1.1030 1.0969 1.0945 1.0914 1.0990 1.0522 1.0621 1.1028 1.0911 1.0918 1.0922 1.1173 1.1147 1.0742 1.0635
irintensity: 0.0838 2.7315 0.6983 0.2088 1.2047 0.5300 0.3607 2.3220 2.9862 1.9010 0.1491 4.7893 0.1351 0.3901 4.3396 0.5604 0.9101 0.3065 4.3604 2.2630 8.9815 2.7322 3.5783 1.2608 20.0416 2.5452 2.2055 2.1356 11.0844 6.5182 14.6192 2.8711 2.0427 9.8605 11.6411 4.0442 14.0012 9.6989 9.2226 9.9650 75.6501 88.9030 12.5849 105.7508 92.5117 56.5745 51.5559 21.7569 7.4376 8.9058 7.8672 24.3238 10.4842 37.7359 1.2556 23.6600 3.6547 16.1098 8.6658 20.7901 32.1904 10.4574 18.0505 20.4046 25.0273 58.2011 92.5183 22.7772 58.8680 369.4970 7.3459 15.5307 5.3029 4.1189 1.3852 22.8949 26.1371 8.1369 3.3924 31.5723 1.8094 31.6208 4.1688 33.1265 27.1865 5.3977 237.0067 23.3142 43.6359 73.6046 50.4347 28.2780 3.3414 6.9460 11.4501 0.2875 46.7265 9.5627 1.0146 41.2202 38.2630 48.2775 184.4432 1.8613 88.3999 48.3410 28.5372 51.1895 33.6256 16.3704 31.0112 14.1663 171.4494 0.9271 81.1226 73.4654 523.3663 55.5637 331.5178 77.5955 82.5206 48.9244 25.1251 28.1527 68.6238 53.2838 33.6708 27.0846 26.1428 6.4915 26.0412 9.1618 2.1370 18.3148 11.9940 10.7255 3.6846 1.8260 18.6698 1.3904 35.4356
temp: 298.150 k
press: 1.00000 atm
elementType: 9 8 8 8 8 7 7 7 6 6 6 6 6 6 6 6 6 6 6 6 6 6 6 6 6 6 6 1 1 1 1 1 1 1 1 1 1 1 1 1 1 1 1 1 1 1 1 1 1
symmnumber: 1
zpe: 1013881.6 jmol-1
zpe.correction: 0.386167 hartree
zpe.thermalcorrener: 0.411790 hartree
zpe.thermalcorrenthalpy: 0.412734 hartree
zpe.thermalcorrgfe: 0.330306 hartree
zpe.sumelectzpe: -1300.154633 hartree
zpe.sumelectthermal: -1300.129010 hartree
zpe.sumelectthermalent: -1300.128065 hartree
zpe.sumelectthermalfe: -1300.210494 hartree
dipole: -6.1507 5.0540 0.9761
dipole: 8.0204
quadrupole: -172.3521 -161.1324 -153.1316
quadrupole: 9.8421 4.3904 -3.0227
quadrupole: -10.1467 1.0730 9.0738 9.8421 4.3904 -3.0227
hfenergy: -1300.5407997 hartree
pointgroup: C01 [X(C19H22F1N3O4)]
dipole: 2.4362998 2.0049166 0.0419014 debye
polarizability: 390.7845315|4.1293004|253.7329244|6.9482984|14.1940373|149.383633 unknown
InChI: InChI=1S/C19H22FN3O4/c1-10-8-22(6-5-21-10)16-14(20)7-12-15(18(16)27-2)23(11-3-4-11)9-13(17(12)24)19(25)26/h7,9-11,21,25H,3-6,8H2,1-2H3
charge 0 multiplicity 1
49 atoms
F  1.587336 -3.283643 0.06671
O  1.13524 1.574007 -0.35582
O  -3.37519 -2.58287 -0.137567
O  -5.815344 -1.297515 -0.60713
O  -5.855957 0.99616 -0.313258
N  -1.734959 1.273255 0.054223
N  2.829662 -0.682943 -0.141006
N  5.672578 -0.126374 -0.407868
C  -1.260955 2.61781 0.422949
C  -2.060095 3.443051 1.437585
C  -0.692443 2.852694 1.819698
C  -0.855503 0.153877 -0.041533
C  -3.088184 1.078122 -0.081154
C  0.561935 0.291659 -0.149226
C  -1.439161 -1.151914 -0.081516
C  1.43521 -0.846668 -0.101209
C  3.495808 0.232802 0.825674
C  4.764704 0.879153 0.204349
C  3.724971 -1.724125 -0.702574
C  4.965201 -1.039168 -1.33388
C  -3.716701 -0.158239 -0.214818
C  -2.917412 -1.394869 -0.142377
C  -0.589636 -2.284229 -0.088059
C  0.786674 -2.120861 -0.050954
C  5.529096 1.710445 1.245782
C  -5.189461 -0.077993 -0.369911
C  1.546593 1.793947 -1.764748
H  -0.779632 3.157642 -0.394708
H  -2.942706 2.997579 1.905611
H  -2.142513 4.517123 1.250977
H  0.177827 3.507807 1.902099
H  -0.697286 2.00761 2.514419
H  -3.708185 1.978354 -0.065491
H  3.791644 -0.344705 1.733613
H  2.782884 1.016971 1.122299
H  4.427661 1.545232 -0.615839
H  3.179416 -2.298292 -1.469354
H  4.052534 -2.437995 0.085062
H  5.671604 -1.81231 -1.687815
H  4.640999 -0.451492 -2.215226
H  6.197999 -0.642014 0.314774
H  -1.053622 -3.275476 -0.078773
H  4.887791 2.501562 1.673693
H  5.884651 1.074495 2.080591
H  6.408896 2.185382 0.778948
H  0.662657 1.762217 -2.430021
H  2.282407 1.030998 -2.076571
H  2.00422 2.795072 -1.787196
H  -6.793253 -1.122932 -0.694457
