program: Gaussian 09
title: 000005210
version: EM64L-G09RevD.01
frameworkgroup: C1[X(C17H26ClN)]
method: RPBEPBE
basis: SDD
operation: Freq
keyword: #p
keyword: freq=noraman
keyword: PBEPBE/SDD
title: #p freq=noraman PBEPBE/SDD
converged: YES YES NO NO
title: Mulliken charges:
elementType: Cl N C C C C C C C C C C C C C C C C C H H H H H H H H H H H H H H H H H H H H H H H H H H
charge: -0.065302 -0.101175 0.226124 -0.546204 -0.544367 -0.131435 -0.453017 0.504281 -0.459420 -0.002641 -0.407847 -0.410968 -0.615413 -0.632793 -0.744533 -0.708632 -0.238323 -0.234296 -0.117251 0.225716 0.218679 0.235142 0.213480 0.223196 0.228331 0.221009 0.192723 0.191781 0.184064 0.244275 0.226304 0.212012 0.224163 0.212707 0.218802 0.201955 0.211830 0.223457 0.212622 0.208546 0.194772 0.252753 0.200553 0.252144 0.252193
chargesum: 0.00000
title: Mulliken charges with hydrogens summed into heavy atoms:
elementType: Cl N C C C C C C C C C C C C C C C C C
charge: -0.065302 -0.101175 0.226124 -0.101809 -0.095744 0.091761 -0.003677 0.504281 -0.074915 0.181423 -0.163572 -0.184664 0.033468 -0.000206 -0.099907 -0.060554 0.013821 0.017897 -0.117251
polarizability: 2.44588936e+02 1.95053063e+01 1.69024326e+02 -2.59453099e+00 4.71032625e+00 1.72656808e+02
1716.lowfreq: -10.0326 -5.1188 0.0010 0.0011 0.0018 7.6226 29.4636 38.1224 39.6800
frequency: 29.1495 38.0057 39.6624 63.5277 74.0050 95.1733 107.8258 120.7431 145.4324 163.6272 185.6451 198.9913 211.3734 218.8636 233.8114 251.2626 265.2223 276.4333 284.0775 298.9123 326.5437 345.0261 357.3083 385.2201 408.0651 415.0329 425.7029 454.1284 464.7219 521.3711 563.6231 617.9586 626.2288 674.3160 720.2107 729.8741 734.5503 791.0192 797.3457 817.8782 825.4067 827.7496 863.8296 892.4445 912.6644 941.2628 952.1181 954.1314 957.1191 961.8081 964.1800 996.5764 1007.2931 1007.3868 1035.0031 1048.4436 1050.8439 1058.9701 1076.1050 1088.0050 1103.1056 1112.3132 1121.0155 1127.4316 1136.3879 1169.1524 1184.5668 1193.1762 1194.1333 1203.3947 1221.8825 1230.0649 1245.9230 1254.6092 1268.1185 1283.9546 1294.7336 1303.0691 1310.7929 1335.5395 1351.7871 1359.1898 1361.5158 1368.3665 1385.0496 1390.3992 1422.7182 1437.1034 1450.8450 1453.4706 1459.5959 1460.5278 1464.8901 1471.2885 1472.8368 1477.0896 1482.9048 1486.1227 1490.6131 1494.4391 1504.2396 1579.4730 1595.2488 2872.5554 2901.7819 2942.0829 2966.2222 2969.4595 2977.6443 2978.9148 2987.6098 2989.5829 3016.3046 3020.4352 3029.6722 3033.9150 3054.3287 3059.3533 3060.9539 3067.6430 3070.8292 3074.5038 3086.1378 3091.4959 3102.5742 3126.7712 3144.0377 3164.5308 3168.6506
redmass: 2.8384 4.2747 5.2501 3.5906 2.4853 2.4003 2.6662 3.2494 3.8589 4.5354 1.3160 1.7203 1.5908 1.3098 2.0109 2.4345 2.9707 1.1925 2.3961 4.2633 3.8970 3.8483 1.9868 2.0091 2.9180 3.1973 2.9412 4.1772 3.0599 2.9368 2.4499 2.8829 7.0772 2.1581 3.2153 3.6095 2.7554 1.3374 2.9514 1.9768 1.5209 1.3917 2.1582 1.6440 1.3390 1.7034 2.0596 2.0328 1.6570 1.8872 1.4285 4.3402 2.3948 3.5161 1.2288 2.5051 1.9314 1.7081 2.5826 1.2490 1.8701 1.7432 1.8973 1.7249 1.5699 1.3239 1.3646 1.3633 1.9501 2.0860 1.3680 1.5014 1.3639 1.4370 1.8795 1.8162 1.2769 1.7685 1.4482 1.4662 1.8649 2.5913 1.3762 1.2365 1.2149 3.7188 1.1322 1.1127 1.0728 1.0929 1.0590 1.0815 1.0976 1.0877 1.0820 1.9146 1.1453 1.0641 1.0568 1.0537 1.0627 7.3520 6.2163 1.0549 1.0478 1.0807 1.0356 1.0395 1.0870 1.0659 1.0752 1.0789 1.0568 1.0597 1.0643 1.0949 1.0993 1.0957 1.0987 1.0992 1.0946 1.1065 1.1053 1.0984 1.1063 1.0888 1.0875 1.0951 1.0965
irintensity: 0.0124 0.0712 0.0562 0.2510 0.0701 0.0798 0.2227 0.3286 0.9321 0.6902 0.5797 0.3197 1.9084 2.5956 2.1172 4.9606 0.3184 0.8141 0.9058 1.6063 12.3449 0.6175 0.5024 0.0948 0.4143 4.0181 3.3217 5.4658 3.1709 23.1548 5.1409 13.4384 0.2310 19.0376 6.4654 33.8846 1.8637 0.4468 0.2109 27.7732 16.0847 13.4194 8.1737 7.3813 2.2559 5.6206 6.2093 4.3800 1.0698 0.8142 0.2950 41.3122 20.3737 4.9289 2.8988 9.6980 19.2994 14.2282 44.2610 4.4119 3.7842 8.1383 9.4582 2.2167 0.3487 0.8428 1.4964 3.4283 11.5335 9.2976 3.4446 11.2456 4.9924 3.7586 1.3554 21.8894 0.8011 14.0370 12.4161 0.5126 5.6217 4.9462 0.7820 18.9565 15.7658 3.2800 8.8607 11.3099 0.6907 23.4462 7.7469 7.3475 2.6475 11.9996 2.7005 72.0242 7.1260 7.3472 24.8325 15.4417 10.2343 1.6614 2.2026 90.5379 122.3021 30.8111 42.8673 44.5773 79.0961 17.8024 62.5204 34.5157 36.5071 42.9947 23.4624 46.9308 32.0911 41.4846 62.7857 55.3746 35.2881 11.6828 3.1929 31.9275 101.5819 9.8772 7.6128 8.6837 1.6398
temp: 298.150 k
press: 1.00000 atm
elementType: 17 7 6 6 6 6 6 6 6 6 6 6 6 6 6 6 6 6 6 1 1 1 1 1 1 1 1 1 1 1 1 1 1 1 1 1 1 1 1 1 1 1 1 1 1
symmnumber: 1
zpe: 1020236.8 jmol-1
zpe.correction: 0.388588 hartree
zpe.thermalcorrener: 0.409536 hartree
zpe.thermalcorrenthalpy: 0.410480 hartree
zpe.thermalcorrgfe: 0.338703 hartree
zpe.sumelectzpe: -1176.686140 hartree
zpe.sumelectthermal: -1176.665192 hartree
zpe.sumelectthermalent: -1176.664247 hartree
zpe.sumelectthermalfe: -1176.736025 hartree
dipole: 2.1000 1.0686 0.1228
dipole: 2.3595
quadrupole: -138.1261 -126.2406 -117.9105
quadrupole: 0.5004 -1.9487 1.7266
quadrupole: -10.7004 1.1851 9.5152 0.5004 -1.9487 1.7266
hfenergy: -1177.0747274 hartree
pointgroup: C01 [X(C17H26Cl1N1)]
dipole: 0.8252423 -0.4230387 -0.0416714 debye
polarizability: 244.6247859|-19.3950465|169.475129|2.4380304|5.1090162|172.1701556 unknown
InChI: InChI=1S/C17H26ClN/c1-13(2)12-16(19(3)4)17(10-5-11-17)14-6-8-15(18)9-7-14/h6-9,13,16H,5,10-12H2,1-4H3
charge 0 multiplicity 1
45 atoms
Cl -5.437817 1.143594 0.268042
N  1.111223 1.107958 -0.921703
C  0.312384 -1.164617 0.070616
C  0.578963 -2.315218 -0.97855
C  0.475227 -2.265587 1.209937
C  1.332795 0.063716 0.107443
C  0.282897 -3.379694 0.127331
C  -1.127981 -0.63099 0.080585
C  2.820446 -0.3958 0.117111
C  3.889105 0.671005 0.520834
C  -1.629651 -0.030917 1.268963
C  -1.992265 -0.681347 -1.041419
C  0.189608 2.215555 -0.632907
C  1.151462 0.719342 -2.332988
C  3.499121 1.463757 1.791837
C  4.263141 1.630333 -0.635047
C  -2.928956 0.513031 1.338716
C  -3.302258 -0.149773 -0.995253
C  -3.749792 0.447459 0.195827
H  1.637864 -2.338804 -1.286231
H  -0.040384 -2.348034 -1.889602
H  -0.264558 -2.236005 2.026874
H  1.486547 -2.285324 1.64952
H  1.138815 0.561387 1.079723
H  0.95748 -4.25008 0.177431
H  -0.760493 -3.737228 0.088541
H  2.91542 -1.244233 0.821994
H  3.098959 -0.79758 -0.877924
H  4.804315 0.089356 0.768619
H  -0.995675 0.016175 2.162248
H  -1.654298 -1.138756 -1.97639
H  0.486729 3.106226 -1.224437
H  -0.879412 2.002745 -0.864148
H  0.252514 2.485114 0.436684
H  1.955658 -0.015487 -2.510929
H  0.196818 0.278305 -2.710446
H  1.370072 1.608362 -2.957689
H  2.666221 2.16106 1.585286
H  4.354409 2.06729 2.148921
H  3.191893 0.791655 2.616364
H  4.634482 1.067476 -1.513087
H  3.379042 2.209384 -0.950566
H  5.061215 2.330424 -0.321187
H  -3.296506 0.974011 2.260336
H  -3.956481 -0.199646 -1.870678
