program: Gaussian 09
title: 000044342
version: EM64L-G09RevD.01
frameworkgroup: C1[X(C20H17N)]
method: RPBEPBE
basis: SDD
operation: Freq
keyword: #pfreq=noraman
keyword: PBEPBE/SDD
title: #p freq=noraman PBEPBE/SDD
converged: YES YES NO NO
title: Mulliken charges:
elementType: N C C C C C C C C C C C C C C C C C C C C H H H H H H H H H H H H H H H H H
charge: -0.004747 0.324681 -0.320721 0.217467 0.278614 0.305896 0.276515 -0.249322 0.343814 -0.708872 0.423569 -0.818839 -0.424159 -0.413884 -0.394863 -0.860295 -0.449566 -0.259744 -0.241508 -0.258307 -0.804447 0.245941 0.238861 0.242222 0.242003 0.218297 0.288192 0.246976 0.242498 0.233064 0.232991 0.235933 0.224139 0.229985 0.226063 0.208445 0.241513 0.241596
chargesum: 0.00000
title: Mulliken charges with hydrogens summed into heavy atoms:
elementType: N C C C C C C C C C C C C C C C C C C C C
charge: -0.004747 0.324681 -0.320721 0.217467 0.278614 0.305896 0.276515 -0.249322 0.343814 -0.462932 0.423569 -0.095754 -0.205861 -0.125692 -0.147886 -0.151743 -0.213633 -0.035605 -0.011524 -0.032244 -0.112893
polarizability: 4.01545436e+02 -1.22677714e+01 2.62238706e+02 2.57188767e-02 -4.67892545e-03 9.73768328e+01
1716.lowfreq: -6.6457 -4.2668 -0.0007 -0.0006 0.0006 6.4362 45.4714 58.0007 92.9130
frequency: 45.4277 57.9978 92.8989 114.8742 128.1489 138.3584 138.8210 179.4176 195.0998 216.0429 227.7448 252.5922 268.6126 321.4267 324.7397 348.1981 367.2683 384.3348 424.6830 471.0527 477.1671 486.6935 517.8141 531.1452 537.5370 550.0078 558.8266 600.7838 613.3256 615.0097 635.2948 698.0317 721.4085 754.3841 765.4564 778.9063 804.8071 809.4800 840.4900 845.4029 891.4196 898.8420 901.4966 903.9920 951.1545 974.0896 975.8902 992.4675 1005.0864 1007.7546 1030.3185 1034.1716 1049.0595 1049.5807 1057.5852 1072.0603 1100.6521 1115.6615 1150.7169 1173.9537 1185.7420 1229.6195 1243.3005 1252.9315 1268.5969 1303.4767 1307.6405 1347.6452 1369.8042 1392.8121 1397.1195 1399.0616 1401.0627 1404.4284 1420.1776 1443.1579 1450.8199 1450.9566 1456.2674 1470.9504 1474.0752 1476.0537 1478.6234 1490.8635 1494.8280 1544.6536 1555.2357 1569.0695 1610.5731 1615.8249 1629.6711 2971.8333 2983.8607 2987.1275 3045.5660 3052.5571 3069.5487 3087.2073 3090.8257 3120.3855 3123.7157 3127.2367 3140.3179 3140.9599 3144.5945 3160.3530 3162.4365 3171.2913
redmass: 3.5696 3.5234 2.1116 1.3858 1.0955 2.9764 4.2959 3.1448 2.9534 2.1052 1.5860 3.5895 3.1881 3.7854 4.6425 4.0134 4.1315 3.9635 3.1026 4.9461 3.8148 4.9481 5.7170 4.9053 3.7631 5.4029 3.3360 3.6131 2.9427 6.0057 4.8896 4.8555 3.6598 6.1555 1.4884 1.3771 4.4867 3.1300 2.3998 5.3459 1.4780 1.3999 4.8210 1.9382 2.4669 1.3717 1.3500 1.8464 1.8128 1.3482 2.4585 1.5745 1.5652 1.5841 2.5506 2.1158 1.8461 2.6176 1.8628 1.1088 1.2646 3.0130 2.0060 2.0470 1.9767 2.3525 4.4055 3.7912 3.3972 2.9425 1.2709 1.2497 1.5683 2.5901 3.2016 3.4622 2.6272 1.0472 2.4022 1.0462 1.1869 1.2083 1.0456 3.7688 1.4838 6.0390 5.0353 7.4374 5.8215 6.3285 6.5575 1.0379 1.0414 1.0359 1.0970 1.0971 1.0964 1.0979 1.1009 1.0927 1.0883 1.0855 1.0902 1.0901 1.0902 1.0951 1.0972 1.0978
irintensity: 0.0124 0.9918 0.4297 2.7455 0.4326 3.8586 0.3620 0.0050 0.6797 1.3930 0.3729 2.0118 0.4502 0.6783 1.1360 0.7249 1.6385 1.3294 4.2807 0.6889 0.1294 1.6063 3.8122 2.7475 0.0679 5.0172 1.5475 3.0467 2.9699 0.7655 3.2640 0.5140 1.1760 1.3989 69.3996 64.6463 0.0462 11.8777 0.0726 2.5433 16.2720 0.2465 2.3886 0.8384 6.1789 2.4875 0.1938 5.4203 10.3008 0.8744 14.1220 1.3321 7.7936 7.5261 2.9683 0.0702 8.5027 1.3453 1.3408 2.6248 2.4422 0.0823 0.7906 6.9861 2.1829 1.3135 1.6780 8.8467 6.9135 20.2526 16.4403 3.6670 31.7602 11.2213 1.1186 24.3917 3.0004 13.1174 4.0463 16.0971 11.9577 25.2266 11.2038 64.1466 22.9143 4.4506 5.8216 0.2023 2.1182 3.9807 12.2038 42.9974 24.2098 26.8739 17.9356 14.4503 14.5143 19.3443 28.1882 16.0140 9.5775 2.2703 36.4489 1.2538 18.2819 30.6078 51.1614 26.4905
temp: 298.150 k
press: 1.00000 atm
elementType: 7 6 6 6 6 6 6 6 6 6 6 6 6 6 6 6 6 6 6 6 6 1 1 1 1 1 1 1 1 1 1 1 1 1 1 1 1 1
symmnumber: 1
zpe: 806824.5 jmol-1
zpe.correction: 0.307303 hartree
zpe.thermalcorrener: 0.324563 hartree
zpe.thermalcorrenthalpy: 0.325507 hartree
zpe.thermalcorrgfe: 0.263148 hartree
zpe.sumelectzpe: -825.691855 hartree
zpe.sumelectthermal: -825.674595 hartree
zpe.sumelectthermalent: -825.673651 hartree
zpe.sumelectthermalfe: -825.736011 hartree
dipole: 0.4201 2.0851 0.0003
dipole: 2.1270
quadrupole: -103.7468 -107.0744 -129.6224
quadrupole: 0.0923 0.0065 -0.0001
quadrupole: 9.7344 6.4068 -16.1412 0.0923 0.0065 -0.0001
hfenergy: -825.9991587 hartree
pointgroup: C01 [X(C20H17N1)]
dipole: 0.1381001 0.8253411 -0.0006437 debye
polarizability: 402.2006005|-7.6421244|261.5806643|-0.9323179|-0.0441574|97.3797099 unknown
InChI: InChI=1S/C20H17N/c1-12-7-6-10-16-14(3)18-11-13(2)15-8-4-5-9-17(15)20(18)21-19(12)16/h4-11H,1-3H3
charge 0 multiplicity 1
38 atoms
N  -0.716644 -1.065634 0.002405
C  0.100589 1.261734 -0.001117
C  0.308584 -0.174179 -0.001553
C  -1.232557 1.76791 0.003997
C  1.679891 -0.69881 -0.005291
C  -2.321091 0.832363 0.007219
C  2.797611 0.205952 -0.009442
C  -2.005719 -0.594214 0.006345
C  2.561493 1.650228 -0.010479
C  1.261879 2.12781 -0.006217
C  -3.068936 -1.580378 0.009445
C  -1.457002 3.269268 0.006826
C  -3.707837 1.218146 0.010874
C  1.913192 -2.103343 -0.004768
C  4.118278 -0.339348 -0.012441
C  3.7334 2.613028 -0.016046
C  -4.39407 -1.139719 0.013099
C  -4.71441 0.256423 0.013679
C  3.219059 -2.615391 -0.008011
C  4.329649 -1.726468 -0.011741
C  -2.720488 -3.052869 0.008626
H  1.106025 3.211568 -0.007434
H  -2.521206 3.542548 0.011549
H  -0.991982 3.736644 0.895069
H  -0.999553 3.739755 -0.883934
H  -3.985061 2.276207 0.011108
H  1.039275 -2.76084 -0.001863
H  4.980073 0.335283 -0.015261
H  3.384815 3.658972 -0.019358
H  4.378213 2.47472 0.873001
H  4.375408 2.468049 -0.905961
H  -5.205878 -1.876543 0.015633
H  -5.765515 0.56619 0.016187
H  3.385152 -3.698249 -0.007632
H  5.350244 -2.125413 -0.014021
H  -3.631976 -3.675107 0.013593
H  -2.113117 -3.313526 -0.876651
H  -2.103988 -3.312367 0.887866
