program: Gaussian 09
title: 000005205
version: EM64L-G09RevD.01
frameworkgroup: C1[X(C19H19N)]
method: RPBEPBE
basis: SDD
operation: Freq
keyword: #pfreq=noraman
keyword: PBEPBE/SDD
title: #p freq=noraman PBEPBE/SDD
converged: YES YES NO NO
title: Mulliken charges:
elementType: N C C C C C C C C C C C C C C C C C C C H H H H H H H H H H H H H H H H H H H
charge: -0.066956 0.107959 0.082852 -0.524477 -0.487269 -0.401385 0.287394 0.248743 0.326549 0.339437 -0.832005 -0.626286 -0.415805 -0.390699 -0.422094 -0.426244 -0.262729 -0.262196 -0.243998 -0.242086 0.244224 0.209390 0.177606 0.248806 0.218529 0.186509 0.222183 0.242839 0.225959 0.185114 0.229485 0.226762 0.228739 0.231934 0.231565 0.225108 0.224784 0.225996 0.225763
chargesum: 0.00000
title: Mulliken charges with hydrogens summed into heavy atoms:
elementType: N C C C C C C C C C C C C C C C C C C C
charge: -0.066956 0.107959 0.082852 -0.070863 -0.060857 0.003653 0.287394 0.248743 0.326549 0.339437 -0.366983 0.014273 -0.189043 -0.161960 -0.190160 -0.194678 -0.037622 -0.037412 -0.018002 -0.016323
polarizability: 2.46443671e+02 7.70038235e+00 2.50060142e+02 -1.32111521e+01 4.40751605e+00 1.36782168e+02
1716.lowfreq: -12.2308 -4.0054 -1.1834 -0.0004 -0.0002 0.0005 51.7715 64.2293 77.0671
frequency: 51.7199 64.2220 77.0459 105.4249 127.5079 162.3164 178.7332 194.2592 234.1098 250.4031 279.9826 301.4607 322.2001 339.7754 350.7342 387.4541 406.7688 428.4146 462.1247 466.5442 500.9313 536.9479 540.9798 545.3040 581.1871 613.0733 625.3517 653.4982 678.8977 740.8484 743.0381 762.3283 764.5877 790.1532 797.3426 822.6116 851.8259 869.5645 881.8568 922.8880 943.8407 948.5026 955.0457 965.4770 981.0751 984.6499 985.2924 990.4700 1044.3099 1046.6673 1051.6821 1063.9405 1080.2880 1114.0647 1120.7391 1130.0666 1157.4009 1168.2876 1174.5192 1177.2704 1193.7516 1197.5238 1207.0326 1217.3260 1241.2681 1263.3457 1276.7593 1279.2095 1283.5594 1300.5897 1316.3033 1342.9378 1362.0612 1370.0184 1376.5107 1379.1932 1429.3696 1430.3556 1439.2472 1442.3442 1454.6721 1456.5185 1464.0323 1477.0360 1477.7264 1480.8765 1484.5813 1568.2742 1576.8817 1607.6073 1608.9350 1620.0278 2776.6993 2829.9963 2853.4283 2975.5347 2980.1118 3002.4412 3019.6325 3031.4631 3039.6713 3058.5606 3078.6280 3117.0937 3118.2292 3126.7502 3127.9182 3141.6181 3142.9807 3160.3309 3161.3160
redmass: 3.3406 4.6955 3.2064 3.1397 3.1815 3.5177 3.1316 2.4242 1.3762 2.5295 4.0542 3.0329 4.3087 2.9376 2.7604 2.6385 2.9743 3.3843 3.3495 3.3620 3.3353 3.5516 3.9998 3.8070 5.1820 4.0411 4.1364 4.8546 4.9526 2.4871 3.5225 1.4478 1.6041 2.8690 3.2970 2.7602 2.9932 1.3953 1.8251 1.8564 1.4550 2.6130 1.7572 2.3164 1.8835 1.3365 1.5443 2.4504 2.2701 2.1765 1.9564 2.6561 1.8014 1.3966 1.8104 2.1370 1.6247 1.2822 1.0806 1.1344 1.5214 1.9308 2.1668 1.7163 3.0146 1.7242 1.5131 1.3587 2.1449 1.5702 1.6595 1.5510 1.6820 7.1709 1.5564 5.0275 1.9481 1.2581 2.2900 1.1460 1.0964 1.1063 1.0576 1.4752 1.6220 1.1053 2.3802 6.5239 6.4418 6.2269 6.3446 7.7359 1.0707 1.0696 1.0583 1.0639 1.0636 1.0844 1.0720 1.0877 1.0956 1.0971 1.1010 1.0863 1.0857 1.0880 1.0876 1.0937 1.0933 1.1007 1.1006
irintensity: 0.3625 0.3168 0.3321 0.5689 0.4233 0.7471 1.0230 3.9487 1.1462 1.2005 0.2678 2.6391 1.4727 2.0882 4.1470 1.6276 0.4330 0.9042 5.8944 5.3920 0.3598 0.4585 3.8084 1.5048 2.1885 14.5716 0.3428 4.9857 1.7476 8.8702 7.8903 90.2991 41.8775 7.0409 0.6843 2.2005 3.8354 0.1452 0.4366 1.2911 0.1052 5.8648 0.7499 8.3690 4.5010 0.0456 1.2179 5.4954 4.9432 3.8202 13.6709 13.4233 6.6010 5.1430 10.8265 18.9063 13.4391 1.5792 0.5994 1.4779 4.4015 2.5958 1.4580 2.6814 5.0524 8.4645 2.3890 0.5365 3.1144 9.8345 12.0966 0.3601 6.3165 0.3281 9.3159 0.6789 5.6878 1.4313 6.0652 5.7607 13.2432 17.9615 18.8063 13.1355 16.0885 13.6772 25.4603 0.5869 1.4520 0.1053 0.0219 5.4906 71.7051 64.7698 213.5253 20.8944 23.4229 25.3714 49.7645 54.6099 24.9900 17.0697 30.4704 1.9711 8.9574 4.1794 4.2518 24.8237 41.8730 45.7315 29.2812
temp: 298.150 k
press: 1.00000 atm
elementType: 7 6 6 6 6 6 6 6 6 6 6 6 6 6 6 6 6 6 6 6 1 1 1 1 1 1 1 1 1 1 1 1 1 1 1 1 1 1 1
symmnumber: 1
zpe: 854530.2 jmol-1
zpe.correction: 0.325473 hartree
zpe.thermalcorrener: 0.341585 hartree
zpe.thermalcorrenthalpy: 0.342529 hartree
zpe.thermalcorrgfe: 0.282631 hartree
zpe.sumelectzpe: -788.750821 hartree
zpe.sumelectthermal: -788.734709 hartree
zpe.sumelectthermalent: -788.733765 hartree
zpe.sumelectthermalfe: -788.793663 hartree
dipole: 0.8162 -0.1703 -0.5265
dipole: 0.9861
quadrupole: -105.0055 -110.6288 -119.5818
quadrupole: -1.8586 -5.6676 2.5807
quadrupole: 6.7332 1.1099 -7.8431 -1.8586 -5.6676 2.5807
hfenergy: -789.0762941 hartree
pointgroup: C01 [X(C19H19N1)]
dipole: 0.3098376 -0.0992782 -0.2113087 debye
polarizability: 247.851472|8.0926079|248.2613991|-13.7648298|6.7072409|137.17311 unknown
InChI: InChI=1S/C19H19N/c1-20-11-10-18-16-8-4-2-6-14(16)12-15-7-3-5-9-17(15)19(18)13-20/h2-9H,10-13H2,1H3
charge 0 multiplicity 1
39 atoms
N  3.339178 -1.065366 0.443946
C  0.508031 -1.14661 -0.011068
C  1.141519 0.081292 -0.017543
C  1.337546 -2.430999 0.041472
C  2.669702 0.177453 0.02346
C  2.81609 -2.219044 -0.312829
C  -0.973754 -1.328867 -0.067136
C  0.450974 1.398817 -0.116223
C  -1.865369 -0.508253 0.695243
C  -0.720805 1.691095 0.649614
C  -1.297007 0.611179 1.551941
C  4.806438 -0.944112 0.389444
C  -1.542803 -2.357485 -0.873178
C  0.985435 2.428522 -0.944282
C  -3.261991 -0.725264 0.625241
C  -1.332946 2.9626 0.547452
C  -2.935066 -2.563876 -0.939262
C  0.370457 3.693228 -1.036758
C  -3.805439 -1.747275 -0.181487
C  -0.797415 3.96641 -0.287831
H  1.26475 -2.853507 1.063526
H  0.912718 -3.193698 -0.636784
H  3.036463 0.501646 -0.990964
H  2.956016 0.984662 0.725017
H  3.401099 -3.117796 -0.043967
H  2.923656 -2.068337 -1.419884
H  -2.080385 1.032184 2.205704
H  -0.492125 0.207856 2.198944
H  5.134633 -0.102258 1.025429
H  5.199281 -0.766414 -0.644886
H  5.270136 -1.867714 0.778819
H  -0.890815 -2.988485 -1.486462
H  1.879353 2.229132 -1.545394
H  -3.927364 -0.085289 1.217365
H  -2.233944 3.1665 1.138755
H  -3.339199 -3.354492 -1.581261
H  0.796303 4.460181 -1.693384
H  -4.888904 -1.905385 -0.219429
H  -1.279848 4.948068 -0.351257
